/root/buildroot/output/host/usr/bin/arm-unknown-linux-uclibcgnueabi-ranlib libdw_pic.a
/root/buildroot/output/host/usr/bin/arm-unknown-linux-uclibcgnueabi-gcc -std=gnu99 -Wall -Wshadow -Wunused -Wextra -fgnu89-inline -Wformat=2 -D__mempcpy=mempcpy -lintl -largp -o libdw.so -shared -o libdw.so -Wl,--soname,libdw.so.1,-z,defs \
-Wl,--enable-new-dtags,-rpath,/usr/lib/elfutils \
-Wl,--version-script,libdw.map,--no-undefined \
-Wl,--whole-archive libdw_pic.a ../libdwfl/libdwfl_pic.a ../libebl/libebl.a ../libelf/libelf.so -Wl,--no-whole-archive\
-ldl -lz
../libdwfl/libdwfl_pic.a(argp-std.os): In function `failure.6724':
argp-std.c:(.text+0x6c): undefined reference to `argp_failure'
argp-std.c:(.text+0x94): undefined reference to `argp_failure'
../libdwfl/libdwfl_pic.a(argp-std.os): In function `parse_opt':
argp-std.c:(.text+0x2a4): undefined reference to `argp_error'
argp-std.c:(.text+0x39c): undefined reference to `argp_failure'
argp-std.c:(.text+0x4f8): undefined reference to `argp_failure'
argp-std.c:(.text+0x5b4): undefined reference to `argp_failure'
collect2: ld returned 1 exit status
make[4]: *** [libdw.so] Error 1
make[4]: Leaving directory `/mnt/sda6/Work/Raumfeld/buildroot/output/build/elfutils-0.155/libdw'
make[3]: *** [all] Error 2
make[3]: Leaving directory `/mnt/sda6/Work/Raumfeld/buildroot/output/build/elfutils-0.155/libdw'
make[2]: *** [all-recursive] Error 1
make[2]: Leaving directory `/mnt/sda6/Work/Raumfeld/buildroot/output/build/elfutils-0.155'
make[1]: *** [all] Error 2
make[1]: Leaving directory `/mnt/sda6/Work/Raumfeld/buildroot/output/build/elfutils-0.155'
make: *** [/root/buildroot/output/build/elfutils-0.155/.stamp_built] Error 2