/home/bryan/source/rockbox-18755/apps/misc.c: In function ‘open_utf8’:
/home/bryan/source/rockbox-18755/apps/misc.c:1212: warning: implicit declaration of function ‘memcmp’
/home/bryan/source/rockbox-18755/apps/metadata/metadata_common.c:110: error: expected declaration specifiers or ‘...’ before ‘(’ token
/home/bryan/source/rockbox-18755/apps/metadata/metadata_common.c:110: error: expected declaration specifiers or ‘...’ before ‘(’ token
/home/bryan/source/rockbox-18755/apps/metadata/metadata_common.c:110: error: expected declaration specifiers or ‘...’ before numeric constant
/home/bryan/source/rockbox-18755/apps/metadata/metadata_common.c: In function ‘sim_read’:
/home/bryan/source/rockbox-18755/apps/metadata/metadata_common.c:111: error: number of arguments doesn’t match prototype
/home/bryan/source/rockbox-18755/firmware/include/file.h:75: error: prototype declaration
/home/bryan/source/rockbox-18755/apps/metadata/metadata_common.c:114: error: ‘fd’ undeclared (first use in this function)
/home/bryan/source/rockbox-18755/apps/metadata/metadata_common.c:114: error: (Each undeclared identifier is reported only once
/home/bryan/source/rockbox-18755/apps/metadata/metadata_common.c:114: error: for each function it appears in.)
/home/bryan/source/rockbox-18755/apps/metadata/metadata_common.c:114: error: ‘buf’ undeclared (first use in this function)
/home/bryan/source/rockbox-18755/apps/metadata/metadata_common.c: At top level:
/home/bryan/source/rockbox-18755/apps/metadata/metadata_common.c:118: error: expected declaration specifiers or ‘...’ before ‘(’ token
/home/bryan/source/rockbox-18755/apps/metadata/metadata_common.c:118: error: expected declaration specifiers or ‘...’ before ‘(’ token
/home/bryan/source/rockbox-18755/apps/metadata/metadata_common.c:118: error: expected declaration specifiers or ‘...’ before numeric constant
/home/bryan/source/rockbox-18755/apps/metadata/metadata_common.c:118: error: redefinition of ‘sim_read’
/home/bryan/source/rockbox-18755/apps/metadata/metadata_common.c:111: error: previous definition of ‘sim_read’ was here
/home/bryan/source/rockbox-18755/apps/metadata/metadata_common.c: In function ‘sim_read’:
/home/bryan/source/rockbox-18755/apps/metadata/metadata_common.c:119: error: number of arguments doesn’t match prototype
/home/bryan/source/rockbox-18755/apps/metadata/metadata_common.c:111: error: prototype declaration
/home/bryan/source/rockbox-18755/apps/metadata/metadata_common.c:122: error: ‘fd’ undeclared (first use in this function)
/home/bryan/source/rockbox-18755/apps/metadata/metadata_common.c:122: error: ‘buf’ undeclared (first use in this function)
/home/bryan/source/rockbox-18755/apps/metadata/metadata_common.c: At top level:
/home/bryan/source/rockbox-18755/apps/metadata/metadata_common.c:126: error: expected declaration specifiers or ‘...’ before ‘(’ token
/home/bryan/source/rockbox-18755/apps/metadata/metadata_common.c:126: error: expected declaration specifiers or ‘...’ before ‘(’ token
/home/bryan/source/rockbox-18755/apps/metadata/metadata_common.c:126: error: expected declaration specifiers or ‘...’ before numeric constant
/home/bryan/source/rockbox-18755/apps/metadata/metadata_common.c:126: error: redefinition of ‘sim_read’
/home/bryan/source/rockbox-18755/apps/metadata/metadata_common.c:111: error: previous definition of ‘sim_read’ was here
/home/bryan/source/rockbox-18755/apps/metadata/metadata_common.c: In function ‘sim_read’:
/home/bryan/source/rockbox-18755/apps/metadata/metadata_common.c:127: error: number of arguments doesn’t match prototype
/home/bryan/source/rockbox-18755/apps/metadata/metadata_common.c:111: error: prototype declaration
/home/bryan/source/rockbox-18755/apps/metadata/metadata_common.c:132: error: ‘fd’ undeclared (first use in this function)
/home/bryan/source/rockbox-18755/apps/metadata/metadata_common.c:134: error: ‘buf’ undeclared (first use in this function)
/home/bryan/source/rockbox-18755/firmware/thread.c: In function ‘check_tmo_threads’:
/home/bryan/source/rockbox-18755/firmware/thread.c:1834: warning: implicit declaration of function ‘enable_irq’
/home/bryan/source/rockbox-18755/firmware/thread.c:1841: warning: implicit declaration of function ‘disable_irq’
/home/bryan/source/rockbox-18755/firmware/thread.c: In function ‘create_thread’:
/home/bryan/source/rockbox-18755/firmware/thread.c:2410: warning: implicit declaration of function ‘disable_irq_save’
/home/bryan/source/rockbox-18755/firmware/thread.c:2472: warning: implicit declaration of function ‘restore_irq’
/home/bryan/source/rockbox-18755/firmware/thread.c: At top level:
/home/bryan/source/rockbox-18755/firmware/thread.c:2392: warning: unused parameter ‘function’
/home/bryan/source/rockbox-18755/firmware/thread.c:129: warning: ‘core_sleep’ used but never defined
/home/bryan/source/rockbox-18755/firmware/thread.c:153: warning: ‘store_context’ used but never defined
/home/bryan/source/rockbox-18755/firmware/thread.c:156: warning: ‘load_context’ used but never defined
/home/bryan/source/rockbox-18755/uisimulator/common/io.c: In function ‘sim_opendir’:
/home/bryan/source/rockbox-18755/uisimulator/common/io.c:264: warning: unused variable ‘buffer’
/home/bryan/source/rockbox-18755/uisimulator/common/io.c: In function ‘sim_open’:
/home/bryan/source/rockbox-18755/uisimulator/common/io.c:367: warning: control reaches end of non-void function
/home/bryan/source/rockbox-18755/uisimulator/common/io.c: At top level:
/home/bryan/source/rockbox-18755/uisimulator/common/io.c:333: warning: unused parameter ‘name’
/home/bryan/source/rockbox-18755/uisimulator/common/io.c:256: warning: ‘get_sim_rootdir’ defined but not used
/home/bryan/source/rockbox-18755/firmware/replaygain.c: In function ‘parse_replaygain_int’:
/home/bryan/source/rockbox-18755/firmware/replaygain.c:426: warning: format ‘%d’ expects type ‘int’, but argument 4 has type ‘long int’
In file included from /home/bryan/source/rockbox-18755/apps/settings.h:26,
from /home/bryan/source/rockbox-18755/apps/tagcache.c:77:
/home/bryan/source/rockbox-18755/firmware/include/inttypes.h:30:1: warning: "INT8_MIN" redefined
In file included from /usr/include/inttypes.h:28,
from /home/bryan/source/rockbox-18755/firmware/export/thread.h:25,
from /home/bryan/source/rockbox-18755/apps/tagcache.c:65:
/usr/include/stdint.h:160:1: warning: this is the location of the previous definition
In file included from /home/bryan/source/rockbox-18755/apps/settings.h:26,
from /home/bryan/source/rockbox-18755/apps/tagcache.c:77:
/home/bryan/source/rockbox-18755/firmware/include/inttypes.h:31:1: warning: "INT8_MAX" redefined
In file included from /usr/include/inttypes.h:28,
from /home/bryan/source/rockbox-18755/firmware/export/thread.h:25,
from /home/bryan/source/rockbox-18755/apps/tagcache.c:65:
/usr/include/stdint.h:165:1: warning: this is the location of the previous definition
In file included from /home/bryan/source/rockbox-18755/apps/settings.h:26,
from /home/bryan/source/rockbox-18755/apps/tagcache.c:77:
/home/bryan/source/rockbox-18755/firmware/include/inttypes.h:32:1: warning: "UINT8_MAX" redefined
In file included from /usr/include/inttypes.h:28,
from /home/bryan/source/rockbox-18755/firmware/export/thread.h:25,
from /home/bryan/source/rockbox-18755/apps/tagcache.c:65:
/usr/include/stdint.h:171:1: warning: this is the location of the previous definition
In file included from /home/bryan/source/rockbox-18755/apps/settings.h:26,
from /home/bryan/source/rockbox-18755/apps/tagcache.c:77:
/home/bryan/source/rockbox-18755/firmware/include/inttypes.h:39:1: warning: "INT16_MIN" redefined
In file included from /usr/include/inttypes.h:28,
from /home/bryan/source/rockbox-18755/firmware/export/thread.h:25,
from /home/bryan/source/rockbox-18755/apps/tagcache.c:65:
/usr/include/stdint.h:161:1: warning: this is the location of the previous definition
In file included from /home/bryan/source/rockbox-18755/apps/settings.h:26,
from /home/bryan/source/rockbox-18755/apps/tagcache.c:77:
/home/bryan/source/rockbox-18755/firmware/include/inttypes.h:40:1: warning: "INT16_MAX" redefined
In file included from /usr/include/inttypes.h:28,
from /home/bryan/source/rockbox-18755/firmware/export/thread.h:25,
from /home/bryan/source/rockbox-18755/apps/tagcache.c:65:
/usr/include/stdint.h:166:1: warning: this is the location of the previous definition
In file included from /home/bryan/source/rockbox-18755/apps/settings.h:26,
from /home/bryan/source/rockbox-18755/apps/tagcache.c:77:
/home/bryan/source/rockbox-18755/firmware/include/inttypes.h:41:1: warning: "UINT16_MAX" redefined
In file included from /usr/include/inttypes.h:28,
from /home/bryan/source/rockbox-18755/firmware/export/thread.h:25,
from /home/bryan/source/rockbox-18755/apps/tagcache.c:65:
/usr/include/stdint.h:172:1: warning: this is the location of the previous definition
In file included from /home/bryan/source/rockbox-18755/apps/settings.h:26,
from /home/bryan/source/rockbox-18755/apps/tagcache.c:77:
/home/bryan/source/rockbox-18755/firmware/include/inttypes.h:50:1: warning: "INT32_MIN" redefined
In file included from /usr/include/inttypes.h:28,
from /home/bryan/source/rockbox-18755/firmware/export/thread.h:25,
from /home/bryan/source/rockbox-18755/apps/tagcache.c:65:
/usr/include/stdint.h:162:1: warning: this is the location of the previous definition
In file included from /home/bryan/source/rockbox-18755/apps/settings.h:26,
from /home/bryan/source/rockbox-18755/apps/tagcache.c:77:
/home/bryan/source/rockbox-18755/firmware/include/inttypes.h:51:1: warning: "INT32_MAX" redefined
In file included from /usr/include/inttypes.h:28,
from /home/bryan/source/rockbox-18755/firmware/export/thread.h:25,
from /home/bryan/source/rockbox-18755/apps/tagcache.c:65:
/usr/include/stdint.h:167:1: warning: this is the location of the previous definition
In file included from /home/bryan/source/rockbox-18755/apps/settings.h:26,
from /home/bryan/source/rockbox-18755/apps/tagcache.c:77:
/home/bryan/source/rockbox-18755/firmware/include/inttypes.h:52:1: warning: "UINT32_MAX" redefined
In file included from /usr/include/inttypes.h:28,
from /home/bryan/source/rockbox-18755/firmware/export/thread.h:25,
from /home/bryan/source/rockbox-18755/apps/tagcache.c:65:
/usr/include/stdint.h:173:1: warning: this is the location of the previous definition
In file included from /home/bryan/source/rockbox-18755/apps/settings.h:26,
from /home/bryan/source/rockbox-18755/apps/tagcache.c:77:
/home/bryan/source/rockbox-18755/firmware/include/inttypes.h:56:1: warning: "INTPTR_MIN" redefined
In file included from /usr/include/inttypes.h:28,
from /home/bryan/source/rockbox-18755/firmware/export/thread.h:25,
from /home/bryan/source/rockbox-18755/apps/tagcache.c:65:
/usr/include/stdint.h:234:1: warning: this is the location of the previous definition
In file included from /home/bryan/source/rockbox-18755/apps/settings.h:26,
from /home/bryan/source/rockbox-18755/apps/tagcache.c:77:
/home/bryan/source/rockbox-18755/firmware/include/inttypes.h:57:1: warning: "INTPTR_MAX" redefined
In file included from /usr/include/inttypes.h:28,
from /home/bryan/source/rockbox-18755/firmware/export/thread.h:25,
from /home/bryan/source/rockbox-18755/apps/tagcache.c:65:
/usr/include/stdint.h:235:1: warning: this is the location of the previous definition
In file included from /home/bryan/source/rockbox-18755/apps/settings.h:26,
from /home/bryan/source/rockbox-18755/apps/tagcache.c:77:
/home/bryan/source/rockbox-18755/firmware/include/inttypes.h:58:1: warning: "UINTPTR_MAX" redefined
In file included from /usr/include/inttypes.h:28,
from /home/bryan/source/rockbox-18755/firmware/export/thread.h:25,
from /home/bryan/source/rockbox-18755/apps/tagcache.c:65:
/usr/include/stdint.h:236:1: warning: this is the location of the previous definition
In file included from /home/bryan/source/rockbox-18755/apps/settings.h:26,
from /home/bryan/source/rockbox-18755/apps/tagcache.c:77:
/home/bryan/source/rockbox-18755/firmware/include/inttypes.h:101:1: warning: "INT64_MIN" redefined
In file included from /usr/include/inttypes.h:28,
from /home/bryan/source/rockbox-18755/firmware/export/thread.h:25,
from /home/bryan/source/rockbox-18755/apps/tagcache.c:65:
/usr/include/stdint.h:163:1: warning: this is the location of the previous definition
In file included from /home/bryan/source/rockbox-18755/apps/settings.h:26,
from /home/bryan/source/rockbox-18755/apps/tagcache.c:77:
/home/bryan/source/rockbox-18755/firmware/include/inttypes.h:102:1: warning: "INT64_MAX" redefined
In file included from /usr/include/inttypes.h:28,
from /home/bryan/source/rockbox-18755/firmware/export/thread.h:25,
from /home/bryan/source/rockbox-18755/apps/tagcache.c:65:
/usr/include/stdint.h:168:1: warning: this is the location of the previous definition
In file included from /home/bryan/source/rockbox-18755/apps/settings.h:26,
from /home/bryan/source/rockbox-18755/apps/tagcache.c:77:
/home/bryan/source/rockbox-18755/firmware/include/inttypes.h:103:1: warning: "UINT64_MAX" redefined
In file included from /usr/include/inttypes.h:28,
from /home/bryan/source/rockbox-18755/firmware/export/thread.h:25,
from /home/bryan/source/rockbox-18755/apps/tagcache.c:65:
/usr/include/stdint.h:174:1: warning: this is the location of the previous definition
/home/bryan/source/rockbox-18755/apps/tagcache.c: In function ‘get_next’:
/home/bryan/source/rockbox-18755/apps/tagcache.c:1370: warning: format ‘%d’ expects type ‘int’, but argument 4 has type ‘long int’
/home/bryan/source/rockbox-18755/apps/tagcache.c: In function ‘tagcache_create_changelog’:
/home/bryan/source/rockbox-18755/apps/tagcache.c:3438: warning: format ‘%d’ expects type ‘int’, but argument 4 has type ‘long int’
/home/bryan/source/rockbox-18755/apps/tagcache.c: At top level:
/home/bryan/source/rockbox-18755/apps/tagcache.c:3090: warning: ‘run_command_queue’ defined but not used
/home/bryan/source/rockbox-18755/apps/tagcache.c:3263: warning: ‘parse_changelog_line’ defined but not used
make: *** [database] Error 1