/tmp/yaourt-tmp-mike/aur-trustedqsl/src/tqsl-2.0/apps/tqsl.cpp:3695:15: note: candidates are:
/tmp/yaourt-tmp-mike/aur-trustedqsl/src/tqsl-2.0/apps/tqsl.cpp:3695:15: note: operator&&(bool, bool) <built-in>
/tmp/yaourt-tmp-mike/aur-trustedqsl/src/tqsl-2.0/apps/tqsl.cpp:3695:15: note:   no known conversion for argument 1 from ‘wxString’ to ‘bool’
In file included from /usr/include/wx-3.0/wx/cmdline.h:19:0,
                 from /tmp/yaourt-tmp-mike/aur-trustedqsl/src/tqsl-2.0/apps/tqsl.cpp:30:
/usr/include/wx-3.0/wx/cmdargs.h:143:13: note: bool operator&&(bool, const wxCmdLineArgsArray&)
 inline bool operator&&(bool cond, const wxCmdLineArgsArray& array)
             ^
/usr/include/wx-3.0/wx/cmdargs.h:143:13: note:   no known conversion for argument 1 from ‘wxString’ to ‘bool’
/tmp/yaourt-tmp-mike/aur-trustedqsl/src/tqsl-2.0/apps/tqsl.cpp:3921:41: warning: ‘void wxSplitPath(const wxString&, wxString*, wxString*, wxString*)’ is deprecated (declared at /usr/include/wx-3.0/wx/filefn.h:745) [-Wdeprecated-declarations]
   wxSplitPath(infile, &path, &name, &ext);
                                         ^
/tmp/yaourt-tmp-mike/aur-trustedqsl/src/tqsl-2.0/apps/tqsl.cpp: In member function ‘void MyFrame::CRQWizard(wxCommandEvent&)’:
/tmp/yaourt-tmp-mike/aur-trustedqsl/src/tqsl-2.0/apps/tqsl.cpp:4249:5: error: ‘wxSAVE’ was not declared in this scope
     wxSAVE | wxOVERWRITE_PROMPT);
     ^
/tmp/yaourt-tmp-mike/aur-trustedqsl/src/tqsl-2.0/apps/tqsl.cpp:4249:14: error: ‘wxOVERWRITE_PROMPT’ was not declared in this scope
     wxSAVE | wxOVERWRITE_PROMPT);
              ^
/tmp/yaourt-tmp-mike/aur-trustedqsl/src/tqsl-2.0/apps/tqsl.cpp: In member function ‘void MyFrame::OnCertExport(wxCommandEvent&)’:
/tmp/yaourt-tmp-mike/aur-trustedqsl/src/tqsl-2.0/apps/tqsl.cpp:4425:3: error: ‘wxSAVE’ was not declared in this scope
   wxSAVE|wxOVERWRITE_PROMPT, this);
   ^
/tmp/yaourt-tmp-mike/aur-trustedqsl/src/tqsl-2.0/apps/tqsl.cpp:4425:10: error: ‘wxOVERWRITE_PROMPT’ was not declared in this scope
   wxSAVE|wxOVERWRITE_PROMPT, this);
          ^
apps/CMakeFiles/tqsl.dir/build.make:57: recipe for target 'apps/CMakeFiles/tqsl.dir/tqsl.cpp.o' failed
make[2]: *** [apps/CMakeFiles/tqsl.dir/tqsl.cpp.o] Error 1
CMakeFiles/Makefile2:128: recipe for target 'apps/CMakeFiles/tqsl.dir/all' failed
make[1]: *** [apps/CMakeFiles/tqsl.dir/all] Error 2
Makefile:116: recipe for target 'all' failed
make: *** [all] Error 2
==> ERROR: A failure occurred in build().
    Aborting...
==> ERROR: Makepkg was unable to build trustedqsl.