g++ -c -m64 -pipe -g -Wall -W -D_REENTRANT -DQT_WEBKIT -DQT_GUI_LIB -DQT_CORE_LIB -DQT_SHARED -I/usr/share/qt4/mkspecs/linux-g++-64 -I. -I/usr/include/qt4/QtCore -I/usr/include/qt4/QtGui -I/usr/include/qt4 -I../lib -I. -o std_analysers.o std_analysers.cpp
std_analysers.cpp: In member function ‘void PinAnalyser::FillList()’:
std_analysers.cpp:696:10: error: expected identifier before numeric constant
std_analysers.cpp: In lambda function:
std_analysers.cpp:696:13: error: expected ‘{’ before ‘=’ token
std_analysers.cpp: In member function ‘void PinAnalyser::FillList()’:
std_analysers.cpp:696:13: warning: lambda expressions only available with -std=c++0x or -std=gnu++0x [enabled by default]
std_analysers.cpp:696:15: error: no match for ‘operator=’ in ‘{} = "bga169"’
std_analysers.cpp:696:15: note: candidate is:
std_analysers.cpp:696:11: note: PinAnalyser::FillList()::<lambda()>& PinAnalyser::FillList()::<lambda()>::operator=(const PinAnalyser::FillList()::<lambda()>&)
std_analysers.cpp:696:11: note:   no known conversion for argument 1 from ‘const char [7]’ to ‘const PinAnalyser::FillList()::<lambda()>&’
std_analysers.cpp:696:26: error: expected identifier before numeric constant
std_analysers.cpp: In lambda function:
std_analysers.cpp:696:29: error: expected ‘{’ before ‘=’ token
std_analysers.cpp: In member function ‘void PinAnalyser::FillList()’:
std_analysers.cpp:696:29: warning: lambda expressions only available with -std=c++0x or -std=gnu++0x [enabled by default]
std_analysers.cpp:696:31: error: no match for ‘operator=’ in ‘{} = "bga100"’
std_analysers.cpp:696:31: note: candidate is:
std_analysers.cpp:696:27: note: PinAnalyser::FillList()::<lambda()>& PinAnalyser::FillList()::<lambda()>::operator=(const PinAnalyser::FillList()::<lambda()>&)
std_analysers.cpp:696:27: note:   no known conversion for argument 1 from ‘const char [7]’ to ‘const PinAnalyser::FillList()::<lambda()>&’
std_analysers.cpp:696:42: error: expected identifier before numeric constant
std_analysers.cpp: In lambda function:
std_analysers.cpp:696:45: error: expected ‘{’ before ‘=’ token
std_analysers.cpp: In member function ‘void PinAnalyser::FillList()’:
std_analysers.cpp:696:45: warning: lambda expressions only available with -std=c++0x or -std=gnu++0x [enabled by default]
std_analysers.cpp:696:47: error: no match for ‘operator=’ in ‘{} = "lqfp100"’
std_analysers.cpp:696:47: note: candidate is:
std_analysers.cpp:696:43: note: PinAnalyser::FillList()::<lambda()>& PinAnalyser::FillList()::<lambda()>::operator=(const PinAnalyser::FillList()::<lambda()>&)
std_analysers.cpp:696:43: note:   no known conversion for argument 1 from ‘const char [8]’ to ‘const PinAnalyser::FillList()::<lambda()>&’
std_analysers.cpp:696:59: error: expected identifier before numeric constant
std_analysers.cpp: In lambda function:
std_analysers.cpp:696:62: error: expected ‘{’ before ‘=’ token
std_analysers.cpp: In member function ‘void PinAnalyser::FillList()’:
std_analysers.cpp:696:62: warning: lambda expressions only available with -std=c++0x or -std=gnu++0x [enabled by default]
std_analysers.cpp:696:64: error: no match for ‘operator=’ in ‘{} = "lqfp128"’
std_analysers.cpp:696:64: note: candidate is:
std_analysers.cpp:696:60: note: PinAnalyser::FillList()::<lambda()>& PinAnalyser::FillList()::<lambda()>::operator=(const PinAnalyser::FillList()::<lambda()>&)
std_analysers.cpp:696:60: note:   no known conversion for argument 1 from ‘const char [8]’ to ‘const PinAnalyser::FillList()::<lambda()>&’
make: *** [std_analysers.o] Error 1