1
2
3
4
5
6
7
8
9
10
11
12
13
14
15
16
/bin/sh: pod2man: command not found
/bin/sh: pod2man: command not found
Building C object src/CMakeFiles/e4rat-lite-core.dir/config.c.o
make[2]: *** [/home/federico/tmp/yaourt-tmp-federico/aur-e4rat-lite-git/src/e4rat-lite/doc/pt_BR/e4rat-lite-collect.8] Errore 127
make[2]: *** Attesa dei processi non terminati....
make[2]: *** [/home/federico/tmp/yaourt-tmp-federico/aur-e4rat-lite-git/src/e4rat-lite/doc/pt_BR/e4rat-lite-realloc.8] Errore 127
make[1]: *** [doc/CMakeFiles/ManPages.dir/all] Errore 2
[ 22%] make[1]: *** Attesa dei processi non terminati....
[ 27%] Building CXX object src/CMakeFiles/e4rat-lite-core.dir/logging.cc.o
[ 27%] Building CXX object src/CMakeFiles/e4rat-lite-core.dir/common.cc.o
Built target pofiles
[ 31%] Building CXX object src/CMakeFiles/e4rat-lite-core.dir/fiemap.cc.o
[ 36%] Building CXX object src/CMakeFiles/e4rat-lite-core.dir/device.cc.o
Linking CXX static library /home/federico/tmp/yaourt-tmp-federico/aur-e4rat-lite-git/src/e4rat-lite/libe4rat-lite-core.a
[ 36%] Built target e4rat-lite-core
make: *** [all] Errore 2