1
2
3
4
5
6
7
8
9
10
11
12
13
14
15
16
make  install-data-hook
make[3]: Entering directory `/home/svine/aur/zoneminder/src/ZoneMinder-1.25.0'
( cd /home/svine/aur/zoneminder/pkg/zoneminder/etc; chown http:http zm.conf; chmod 600 zm.conf )
chown: cannot access ‘zm.conf’: No such file or directory
chmod: cannot access ‘zm.conf’: No such file or directory
make[3]: *** [install-data-hook] Error 1
make[3]: Leaving directory `/home/svine/aur/zoneminder/src/ZoneMinder-1.25.0'
make[2]: *** [install-data-am] Error 2
make[2]: *** Waiting for unfinished jobs....
 /usr/bin/install -c -m 644 zm.conf '/home/svine/aur/zoneminder/pkg/zoneminder/etc'
make[2]: Leaving directory `/home/svine/aur/zoneminder/src/ZoneMinder-1.25.0'
make[1]: *** [install-am] Error 2
make[1]: Leaving directory `/home/svine/aur/zoneminder/src/ZoneMinder-1.25.0'
make: *** [install-recursive] Error 1
==> ERROR: A failure occurred in package().
    Aborting...