Making all in include
make[4]: Entering directory `/home/christian/yaourt-tmp-christian/aur-mingw-w64-gcc/src/gcc-build-i686-w64-mingw32/i686-w64-mingw32/libstdc++-v3/include'
mkdir -p ./i686-w64-mingw32/bits/stdc++.h.gch
/home/christian/yaourt-tmp-christian/aur-mingw-w64-gcc/src/gcc-build-i686-w64-mingw32/./gcc/xgcc -shared-libgcc -B/home/christian/yaourt-tmp-christian/aur-mingw-w64-gcc/src/gcc-build-i686-w64-mingw32/./gcc -nostdinc++ -L/home/christian/yaourt-tmp-christian/aur-mingw-w64-gcc/src/gcc-build-i686-w64-mingw32/i686-w64-mingw32/libstdc++-v3/src -L/home/christian/yaourt-tmp-christian/aur-mingw-w64-gcc/src/gcc-build-i686-w64-mingw32/i686-w64-mingw32/libstdc++-v3/src/.libs -L/usr/i686-w64-mingw32/lib -L/usr/mingw/lib -isystem /usr/i686-w64-mingw32/include -isystem /usr/mingw/include -B/usr/i686-w64-mingw32/bin/ -B/usr/i686-w64-mingw32/lib/ -isystem /usr/i686-w64-mingw32/include -isystem /usr/i686-w64-mingw32/sys-include    -x c++-header -nostdinc++ -g -O2 -I/home/christian/yaourt-tmp-christian/aur-mingw-w64-gcc/src/gcc-build-i686-w64-mingw32/i686-w64-mingw32/libstdc++-v3/include/i686-w64-mingw32 -I/home/christian/yaourt-tmp-christian/aur-mingw-w64-gcc/src/gcc-build-i686-w64-mingw32/i686-w64-mingw32/libstdc++-v3/include -I/home/christian/yaourt-tmp-christian/aur-mingw-w64-gcc/src/gcc-4.8.0/libstdc++-v3/libsupc++ -O2 -g -std=gnu++0x /home/christian/yaourt-tmp-christian/aur-mingw-w64-gcc/src/gcc-4.8.0/libstdc++-v3/include/precompiled/stdc++.h \
-o i686-w64-mingw32/bits/stdc++.h.gch/O2ggnu++0x.gch
In file included from /home/christian/yaourt-tmp-christian/aur-mingw-w64-gcc/src/gcc-build-i686-w64-mingw32/i686-w64-mingw32/libstdc++-v3/include/string:52:0,
                 from /home/christian/yaourt-tmp-christian/aur-mingw-w64-gcc/src/gcc-build-i686-w64-mingw32/i686-w64-mingw32/libstdc++-v3/include/bits/locale_classes.h:40,
                 from /home/christian/yaourt-tmp-christian/aur-mingw-w64-gcc/src/gcc-build-i686-w64-mingw32/i686-w64-mingw32/libstdc++-v3/include/bits/ios_base.h:41,
                 from /home/christian/yaourt-tmp-christian/aur-mingw-w64-gcc/src/gcc-build-i686-w64-mingw32/i686-w64-mingw32/libstdc++-v3/include/ios:42,
                 from /home/christian/yaourt-tmp-christian/aur-mingw-w64-gcc/src/gcc-build-i686-w64-mingw32/i686-w64-mingw32/libstdc++-v3/include/istream:38,
                 from /home/christian/yaourt-tmp-christian/aur-mingw-w64-gcc/src/gcc-build-i686-w64-mingw32/i686-w64-mingw32/libstdc++-v3/include/sstream:38,
                 from /home/christian/yaourt-tmp-christian/aur-mingw-w64-gcc/src/gcc-build-i686-w64-mingw32/i686-w64-mingw32/libstdc++-v3/include/complex:45,
                 from /home/christian/yaourt-tmp-christian/aur-mingw-w64-gcc/src/gcc-build-i686-w64-mingw32/i686-w64-mingw32/libstdc++-v3/include/ccomplex:38,
                 from /home/christian/yaourt-tmp-christian/aur-mingw-w64-gcc/src/gcc-4.8.0/libstdc++-v3/include/precompiled/stdc++.h:52:
/home/christian/yaourt-tmp-christian/aur-mingw-w64-gcc/src/gcc-build-i686-w64-mingw32/i686-w64-mingw32/libstdc++-v3/include/bits/basic_string.h: In function 'std::wstring std::to_wstring(int)':
/home/christian/yaourt-tmp-christian/aur-mingw-w64-gcc/src/gcc-build-i686-w64-mingw32/i686-w64-mingw32/libstdc++-v3/include/bits/basic_string.h:2969:22: error: no matching function for call to '__to_xstring(int (*)(wchar_t*, const wchar_t*, char*), unsigned int, const wchar_t [3], int&)'
          L"%d", __val); }
                      ^
/home/christian/yaourt-tmp-christian/aur-mingw-w64-gcc/src/gcc-build-i686-w64-mingw32/i686-w64-mingw32/libstdc++-v3/include/bits/basic_string.h:2969:22: note: candidate is:
In file included from /home/christian/yaourt-tmp-christian/aur-mingw-w64-gcc/src/gcc-build-i686-w64-mingw32/i686-w64-mingw32/libstdc++-v3/include/bits/basic_string.h:2817:0,
                 from /home/christian/yaourt-tmp-christian/aur-mingw-w64-gcc/src/gcc-build-i686-w64-mingw32/i686-w64-mingw32/libstdc++-v3/include/string:52,
                 from /home/christian/yaourt-tmp-christian/aur-mingw-w64-gcc/src/gcc-build-i686-w64-mingw32/i686-w64-mingw32/libstdc++-v3/include/bits/locale_classes.h:40,
                 from /home/christian/yaourt-tmp-christian/aur-mingw-w64-gcc/src/gcc-build-i686-w64-mingw32/i686-w64-mingw32/libstdc++-v3/include/bits/ios_base.h:41,
                 from /home/christian/yaourt-tmp-christian/aur-mingw-w64-gcc/src/gcc-build-i686-w64-mingw32/i686-w64-mingw32/libstdc++-v3/include/ios:42,
                 from /home/christian/yaourt-tmp-christian/aur-mingw-w64-gcc/src/gcc-build-i686-w64-mingw32/i686-w64-mingw32/libstdc++-v3/include/istream:38,
                 from /home/christian/yaourt-tmp-christian/aur-mingw-w64-gcc/src/gcc-build-i686-w64-mingw32/i686-w64-mingw32/libstdc++-v3/include/sstream:38,
                 from /home/christian/yaourt-tmp-christian/aur-mingw-w64-gcc/src/gcc-build-i686-w64-mingw32/i686-w64-mingw32/libstdc++-v3/include/complex:45,
                 from /home/christian/yaourt-tmp-christian/aur-mingw-w64-gcc/src/gcc-build-i686-w64-mingw32/i686-w64-mingw32/libstdc++-v3/include/ccomplex:38,
                 from /home/christian/yaourt-tmp-christian/aur-mingw-w64-gcc/src/gcc-4.8.0/libstdc++-v3/include/precompiled/stdc++.h:52:
/home/christian/yaourt-tmp-christian/aur-mingw-w64-gcc/src/gcc-build-i686-w64-mingw32/i686-w64-mingw32/libstdc++-v3/include/ext/string_conversions.h:83:5: note: template<class _String, class _CharT> _String __gnu_cxx::__to_xstring(int (*)(_CharT*, std::size_t, const _CharT*, char*), std::size_t, const _CharT*, ...)
     __to_xstring(int (*__convf) (_CharT*, std::size_t, const _CharT*,
     ^
/home/christian/yaourt-tmp-christian/aur-mingw-w64-gcc/src/gcc-build-i686-w64-mingw32/i686-w64-mingw32/libstdc++-v3/include/ext/string_conversions.h:83:5: note:   template argument deduction/substitution failed:
In file included from /home/christian/yaourt-tmp-christian/aur-mingw-w64-gcc/src/gcc-build-i686-w64-mingw32/i686-w64-mingw32/libstdc++-v3/include/string:52:0,
                 from /home/christian/yaourt-tmp-christian/aur-mingw-w64-gcc/src/gcc-build-i686-w64-mingw32/i686-w64-mingw32/libstdc++-v3/include/bits/locale_classes.h:40,
                 from /home/christian/yaourt-tmp-christian/aur-mingw-w64-gcc/src/gcc-build-i686-w64-mingw32/i686-w64-mingw32/libstdc++-v3/include/bits/ios_base.h:41,
                 from /home/christian/yaourt-tmp-christian/aur-mingw-w64-gcc/src/gcc-build-i686-w64-mingw32/i686-w64-mingw32/libstdc++-v3/include/ios:42,
                 from /home/christian/yaourt-tmp-christian/aur-mingw-w64-gcc/src/gcc-build-i686-w64-mingw32/i686-w64-mingw32/libstdc++-v3/include/istream:38,
                 from /home/christian/yaourt-tmp-christian/aur-mingw-w64-gcc/src/gcc-build-i686-w64-mingw32/i686-w64-mingw32/libstdc++-v3/include/sstream:38,
                 from /home/christian/yaourt-tmp-christian/aur-mingw-w64-gcc/src/gcc-build-i686-w64-mingw32/i686-w64-mingw32/libstdc++-v3/include/complex:45,
                 from /home/christian/yaourt-tmp-christian/aur-mingw-w64-gcc/src/gcc-build-i686-w64-mingw32/i686-w64-mingw32/libstdc++-v3/include/ccomplex:38,
                 from /home/christian/yaourt-tmp-christian/aur-mingw-w64-gcc/src/gcc-4.8.0/libstdc++-v3/include/precompiled/stdc++.h:52:
/home/christian/yaourt-tmp-christian/aur-mingw-w64-gcc/src/gcc-build-i686-w64-mingw32/i686-w64-mingw32/libstdc++-v3/include/bits/basic_string.h:2969:22: note:   mismatched types 'std::size_t {aka unsigned int}' and 'const wchar_t*'
          L"%d", __val); }
                      ^
/home/christian/yaourt-tmp-christian/aur-mingw-w64-gcc/src/gcc-build-i686-w64-mingw32/i686-w64-mingw32/libstdc++-v3/include/bits/basic_string.h: In function 'std::wstring std::to_wstring(unsigned int)':
/home/christian/yaourt-tmp-christian/aur-mingw-w64-gcc/src/gcc-build-i686-w64-mingw32/i686-w64-mingw32/libstdc++-v3/include/bits/basic_string.h:2975:22: error: no matching function for call to '__to_xstring(int (*)(wchar_t*, const wchar_t*, char*), unsigned int, const wchar_t [3], unsigned int&)'
          L"%u", __val); }
                      ^
/home/christian/yaourt-tmp-christian/aur-mingw-w64-gcc/src/gcc-build-i686-w64-mingw32/i686-w64-mingw32/libstdc++-v3/include/bits/basic_string.h:2975:22: note: candidate is:
In file included from /home/christian/yaourt-tmp-christian/aur-mingw-w64-gcc/src/gcc-build-i686-w64-mingw32/i686-w64-mingw32/libstdc++-v3/include/bits/basic_string.h:2817:0,
                 from /home/christian/yaourt-tmp-christian/aur-mingw-w64-gcc/src/gcc-build-i686-w64-mingw32/i686-w64-mingw32/libstdc++-v3/include/string:52,
                 from /home/christian/yaourt-tmp-christian/aur-mingw-w64-gcc/src/gcc-build-i686-w64-mingw32/i686-w64-mingw32/libstdc++-v3/include/bits/locale_classes.h:40,
                 from /home/christian/yaourt-tmp-christian/aur-mingw-w64-gcc/src/gcc-build-i686-w64-mingw32/i686-w64-mingw32/libstdc++-v3/include/bits/ios_base.h:41,
                 from /home/christian/yaourt-tmp-christian/aur-mingw-w64-gcc/src/gcc-build-i686-w64-mingw32/i686-w64-mingw32/libstdc++-v3/include/ios:42,
                 from /home/christian/yaourt-tmp-christian/aur-mingw-w64-gcc/src/gcc-build-i686-w64-mingw32/i686-w64-mingw32/libstdc++-v3/include/istream:38,
                 from /home/christian/yaourt-tmp-christian/aur-mingw-w64-gcc/src/gcc-build-i686-w64-mingw32/i686-w64-mingw32/libstdc++-v3/include/sstream:38,
                 from /home/christian/yaourt-tmp-christian/aur-mingw-w64-gcc/src/gcc-build-i686-w64-mingw32/i686-w64-mingw32/libstdc++-v3/include/complex:45,
                 from /home/christian/yaourt-tmp-christian/aur-mingw-w64-gcc/src/gcc-build-i686-w64-mingw32/i686-w64-mingw32/libstdc++-v3/include/ccomplex:38,
                 from /home/christian/yaourt-tmp-christian/aur-mingw-w64-gcc/src/gcc-4.8.0/libstdc++-v3/include/precompiled/stdc++.h:52:
/home/christian/yaourt-tmp-christian/aur-mingw-w64-gcc/src/gcc-build-i686-w64-mingw32/i686-w64-mingw32/libstdc++-v3/include/ext/string_conversions.h:83:5: note: template<class _String, class _CharT> _String __gnu_cxx::__to_xstring(int (*)(_CharT*, std::size_t, const _CharT*, char*), std::size_t, const _CharT*, ...)
     __to_xstring(int (*__convf) (_CharT*, std::size_t, const _CharT*,
     ^
/home/christian/yaourt-tmp-christian/aur-mingw-w64-gcc/src/gcc-build-i686-w64-mingw32/i686-w64-mingw32/libstdc++-v3/include/ext/string_conversions.h:83:5: note:   template argument deduction/substitution failed:
In file included from /home/christian/yaourt-tmp-christian/aur-mingw-w64-gcc/src/gcc-build-i686-w64-mingw32/i686-w64-mingw32/libstdc++-v3/include/string:52:0,
                 from /home/christian/yaourt-tmp-christian/aur-mingw-w64-gcc/src/gcc-build-i686-w64-mingw32/i686-w64-mingw32/libstdc++-v3/include/bits/locale_classes.h:40,
                 from /home/christian/yaourt-tmp-christian/aur-mingw-w64-gcc/src/gcc-build-i686-w64-mingw32/i686-w64-mingw32/libstdc++-v3/include/bits/ios_base.h:41,
                 from /home/christian/yaourt-tmp-christian/aur-mingw-w64-gcc/src/gcc-build-i686-w64-mingw32/i686-w64-mingw32/libstdc++-v3/include/ios:42,
                 from /home/christian/yaourt-tmp-christian/aur-mingw-w64-gcc/src/gcc-build-i686-w64-mingw32/i686-w64-mingw32/libstdc++-v3/include/istream:38,
                 from /home/christian/yaourt-tmp-christian/aur-mingw-w64-gcc/src/gcc-build-i686-w64-mingw32/i686-w64-mingw32/libstdc++-v3/include/sstream:38,
                 from /home/christian/yaourt-tmp-christian/aur-mingw-w64-gcc/src/gcc-build-i686-w64-mingw32/i686-w64-mingw32/libstdc++-v3/include/complex:45,
                 from /home/christian/yaourt-tmp-christian/aur-mingw-w64-gcc/src/gcc-build-i686-w64-mingw32/i686-w64-mingw32/libstdc++-v3/include/ccomplex:38,
                 from /home/christian/yaourt-tmp-christian/aur-mingw-w64-gcc/src/gcc-4.8.0/libstdc++-v3/include/precompiled/stdc++.h:52:
/home/christian/yaourt-tmp-christian/aur-mingw-w64-gcc/src/gcc-build-i686-w64-mingw32/i686-w64-mingw32/libstdc++-v3/include/bits/basic_string.h:2975:22: note:   mismatched types 'std::size_t {aka unsigned int}' and 'const wchar_t*'
          L"%u", __val); }
                      ^
/home/christian/yaourt-tmp-christian/aur-mingw-w64-gcc/src/gcc-build-i686-w64-mingw32/i686-w64-mingw32/libstdc++-v3/include/bits/basic_string.h: In function 'std::wstring std::to_wstring(long int)':
/home/christian/yaourt-tmp-christian/aur-mingw-w64-gcc/src/gcc-build-i686-w64-mingw32/i686-w64-mingw32/libstdc++-v3/include/bits/basic_string.h:2980:23: error: no matching function for call to '__to_xstring(int (*)(wchar_t*, const wchar_t*, char*), unsigned int, const wchar_t [4], long int&)'
          L"%ld", __val); }
                       ^
/home/christian/yaourt-tmp-christian/aur-mingw-w64-gcc/src/gcc-build-i686-w64-mingw32/i686-w64-mingw32/libstdc++-v3/include/bits/basic_string.h:2980:23: note: candidate is:
In file included from /home/christian/yaourt-tmp-christian/aur-mingw-w64-gcc/src/gcc-build-i686-w64-mingw32/i686-w64-mingw32/libstdc++-v3/include/bits/basic_string.h:2817:0,
                 from /home/christian/yaourt-tmp-christian/aur-mingw-w64-gcc/src/gcc-build-i686-w64-mingw32/i686-w64-mingw32/libstdc++-v3/include/string:52,
                 from /home/christian/yaourt-tmp-christian/aur-mingw-w64-gcc/src/gcc-build-i686-w64-mingw32/i686-w64-mingw32/libstdc++-v3/include/bits/locale_classes.h:40,
                 from /home/christian/yaourt-tmp-christian/aur-mingw-w64-gcc/src/gcc-build-i686-w64-mingw32/i686-w64-mingw32/libstdc++-v3/include/bits/ios_base.h:41,
                 from /home/christian/yaourt-tmp-christian/aur-mingw-w64-gcc/src/gcc-build-i686-w64-mingw32/i686-w64-mingw32/libstdc++-v3/include/ios:42,
                 from /home/christian/yaourt-tmp-christian/aur-mingw-w64-gcc/src/gcc-build-i686-w64-mingw32/i686-w64-mingw32/libstdc++-v3/include/istream:38,
                 from /home/christian/yaourt-tmp-christian/aur-mingw-w64-gcc/src/gcc-build-i686-w64-mingw32/i686-w64-mingw32/libstdc++-v3/include/sstream:38,
                 from /home/christian/yaourt-tmp-christian/aur-mingw-w64-gcc/src/gcc-build-i686-w64-mingw32/i686-w64-mingw32/libstdc++-v3/include/complex:45,
                 from /home/christian/yaourt-tmp-christian/aur-mingw-w64-gcc/src/gcc-build-i686-w64-mingw32/i686-w64-mingw32/libstdc++-v3/include/ccomplex:38,
                 from /home/christian/yaourt-tmp-christian/aur-mingw-w64-gcc/src/gcc-4.8.0/libstdc++-v3/include/precompiled/stdc++.h:52:
/home/christian/yaourt-tmp-christian/aur-mingw-w64-gcc/src/gcc-build-i686-w64-mingw32/i686-w64-mingw32/libstdc++-v3/include/ext/string_conversions.h:83:5: note: template<class _String, class _CharT> _String __gnu_cxx::__to_xstring(int (*)(_CharT*, std::size_t, const _CharT*, char*), std::size_t, const _CharT*, ...)
     __to_xstring(int (*__convf) (_CharT*, std::size_t, const _CharT*,
     ^
/home/christian/yaourt-tmp-christian/aur-mingw-w64-gcc/src/gcc-build-i686-w64-mingw32/i686-w64-mingw32/libstdc++-v3/include/ext/string_conversions.h:83:5: note:   template argument deduction/substitution failed:
In file included from /home/christian/yaourt-tmp-christian/aur-mingw-w64-gcc/src/gcc-build-i686-w64-mingw32/i686-w64-mingw32/libstdc++-v3/include/string:52:0,
                 from /home/christian/yaourt-tmp-christian/aur-mingw-w64-gcc/src/gcc-build-i686-w64-mingw32/i686-w64-mingw32/libstdc++-v3/include/bits/locale_classes.h:40,
                 from /home/christian/yaourt-tmp-christian/aur-mingw-w64-gcc/src/gcc-build-i686-w64-mingw32/i686-w64-mingw32/libstdc++-v3/include/bits/ios_base.h:41,
                 from /home/christian/yaourt-tmp-christian/aur-mingw-w64-gcc/src/gcc-build-i686-w64-mingw32/i686-w64-mingw32/libstdc++-v3/include/ios:42,
                 from /home/christian/yaourt-tmp-christian/aur-mingw-w64-gcc/src/gcc-build-i686-w64-mingw32/i686-w64-mingw32/libstdc++-v3/include/istream:38,
                 from /home/christian/yaourt-tmp-christian/aur-mingw-w64-gcc/src/gcc-build-i686-w64-mingw32/i686-w64-mingw32/libstdc++-v3/include/sstream:38,
                 from /home/christian/yaourt-tmp-christian/aur-mingw-w64-gcc/src/gcc-build-i686-w64-mingw32/i686-w64-mingw32/libstdc++-v3/include/complex:45,
                 from /home/christian/yaourt-tmp-christian/aur-mingw-w64-gcc/src/gcc-build-i686-w64-mingw32/i686-w64-mingw32/libstdc++-v3/include/ccomplex:38,
                 from /home/christian/yaourt-tmp-christian/aur-mingw-w64-gcc/src/gcc-4.8.0/libstdc++-v3/include/precompiled/stdc++.h:52:
/home/christian/yaourt-tmp-christian/aur-mingw-w64-gcc/src/gcc-build-i686-w64-mingw32/i686-w64-mingw32/libstdc++-v3/include/bits/basic_string.h:2980:23: note:   mismatched types 'std::size_t {aka unsigned int}' and 'const wchar_t*'
          L"%ld", __val); }
                       ^
/home/christian/yaourt-tmp-christian/aur-mingw-w64-gcc/src/gcc-build-i686-w64-mingw32/i686-w64-mingw32/libstdc++-v3/include/bits/basic_string.h: In function 'std::wstring std::to_wstring(long unsigned int)':
/home/christian/yaourt-tmp-christian/aur-mingw-w64-gcc/src/gcc-build-i686-w64-mingw32/i686-w64-mingw32/libstdc++-v3/include/bits/basic_string.h:2986:23: error: no matching function for call to '__to_xstring(int (*)(wchar_t*, const wchar_t*, char*), unsigned int, const wchar_t [4], long unsigned int&)'
          L"%lu", __val); }
                       ^
/home/christian/yaourt-tmp-christian/aur-mingw-w64-gcc/src/gcc-build-i686-w64-mingw32/i686-w64-mingw32/libstdc++-v3/include/bits/basic_string.h:2986:23: note: candidate is:
In file included from /home/christian/yaourt-tmp-christian/aur-mingw-w64-gcc/src/gcc-build-i686-w64-mingw32/i686-w64-mingw32/libstdc++-v3/include/bits/basic_string.h:2817:0,
                 from /home/christian/yaourt-tmp-christian/aur-mingw-w64-gcc/src/gcc-build-i686-w64-mingw32/i686-w64-mingw32/libstdc++-v3/include/string:52,
                 from /home/christian/yaourt-tmp-christian/aur-mingw-w64-gcc/src/gcc-build-i686-w64-mingw32/i686-w64-mingw32/libstdc++-v3/include/bits/locale_classes.h:40,
                 from /home/christian/yaourt-tmp-christian/aur-mingw-w64-gcc/src/gcc-build-i686-w64-mingw32/i686-w64-mingw32/libstdc++-v3/include/bits/ios_base.h:41,
                 from /home/christian/yaourt-tmp-christian/aur-mingw-w64-gcc/src/gcc-build-i686-w64-mingw32/i686-w64-mingw32/libstdc++-v3/include/ios:42,
                 from /home/christian/yaourt-tmp-christian/aur-mingw-w64-gcc/src/gcc-build-i686-w64-mingw32/i686-w64-mingw32/libstdc++-v3/include/istream:38,
                 from /home/christian/yaourt-tmp-christian/aur-mingw-w64-gcc/src/gcc-build-i686-w64-mingw32/i686-w64-mingw32/libstdc++-v3/include/sstream:38,
                 from /home/christian/yaourt-tmp-christian/aur-mingw-w64-gcc/src/gcc-build-i686-w64-mingw32/i686-w64-mingw32/libstdc++-v3/include/complex:45,
                 from /home/christian/yaourt-tmp-christian/aur-mingw-w64-gcc/src/gcc-build-i686-w64-mingw32/i686-w64-mingw32/libstdc++-v3/include/ccomplex:38,
                 from /home/christian/yaourt-tmp-christian/aur-mingw-w64-gcc/src/gcc-4.8.0/libstdc++-v3/include/precompiled/stdc++.h:52:
/home/christian/yaourt-tmp-christian/aur-mingw-w64-gcc/src/gcc-build-i686-w64-mingw32/i686-w64-mingw32/libstdc++-v3/include/ext/string_conversions.h:83:5: note: template<class _String, class _CharT> _String __gnu_cxx::__to_xstring(int (*)(_CharT*, std::size_t, const _CharT*, char*), std::size_t, const _CharT*, ...)
     __to_xstring(int (*__convf) (_CharT*, std::size_t, const _CharT*,
     ^
/home/christian/yaourt-tmp-christian/aur-mingw-w64-gcc/src/gcc-build-i686-w64-mingw32/i686-w64-mingw32/libstdc++-v3/include/ext/string_conversions.h:83:5: note:   template argument deduction/substitution failed:
In file included from /home/christian/yaourt-tmp-christian/aur-mingw-w64-gcc/src/gcc-build-i686-w64-mingw32/i686-w64-mingw32/libstdc++-v3/include/string:52:0,
                 from /home/christian/yaourt-tmp-christian/aur-mingw-w64-gcc/src/gcc-build-i686-w64-mingw32/i686-w64-mingw32/libstdc++-v3/include/bits/locale_classes.h:40,
                 from /home/christian/yaourt-tmp-christian/aur-mingw-w64-gcc/src/gcc-build-i686-w64-mingw32/i686-w64-mingw32/libstdc++-v3/include/bits/ios_base.h:41,
                 from /home/christian/yaourt-tmp-christian/aur-mingw-w64-gcc/src/gcc-build-i686-w64-mingw32/i686-w64-mingw32/libstdc++-v3/include/ios:42,
                 from /home/christian/yaourt-tmp-christian/aur-mingw-w64-gcc/src/gcc-build-i686-w64-mingw32/i686-w64-mingw32/libstdc++-v3/include/istream:38,
                 from /home/christian/yaourt-tmp-christian/aur-mingw-w64-gcc/src/gcc-build-i686-w64-mingw32/i686-w64-mingw32/libstdc++-v3/include/sstream:38,
                 from /home/christian/yaourt-tmp-christian/aur-mingw-w64-gcc/src/gcc-build-i686-w64-mingw32/i686-w64-mingw32/libstdc++-v3/include/complex:45,
                 from /home/christian/yaourt-tmp-christian/aur-mingw-w64-gcc/src/gcc-build-i686-w64-mingw32/i686-w64-mingw32/libstdc++-v3/include/ccomplex:38,
                 from /home/christian/yaourt-tmp-christian/aur-mingw-w64-gcc/src/gcc-4.8.0/libstdc++-v3/include/precompiled/stdc++.h:52:
/home/christian/yaourt-tmp-christian/aur-mingw-w64-gcc/src/gcc-build-i686-w64-mingw32/i686-w64-mingw32/libstdc++-v3/include/bits/basic_string.h:2986:23: note:   mismatched types 'std::size_t {aka unsigned int}' and 'const wchar_t*'
          L"%lu", __val); }
                       ^
/home/christian/yaourt-tmp-christian/aur-mingw-w64-gcc/src/gcc-build-i686-w64-mingw32/i686-w64-mingw32/libstdc++-v3/include/bits/basic_string.h: In function 'std::wstring std::to_wstring(long long int)':
/home/christian/yaourt-tmp-christian/aur-mingw-w64-gcc/src/gcc-build-i686-w64-mingw32/i686-w64-mingw32/libstdc++-v3/include/bits/basic_string.h:2992:24: error: no matching function for call to '__to_xstring(int (*)(wchar_t*, const wchar_t*, char*), unsigned int, const wchar_t [5], long long int&)'
          L"%lld", __val); }
                        ^
/home/christian/yaourt-tmp-christian/aur-mingw-w64-gcc/src/gcc-build-i686-w64-mingw32/i686-w64-mingw32/libstdc++-v3/include/bits/basic_string.h:2992:24: note: candidate is:
In file included from /home/christian/yaourt-tmp-christian/aur-mingw-w64-gcc/src/gcc-build-i686-w64-mingw32/i686-w64-mingw32/libstdc++-v3/include/bits/basic_string.h:2817:0,
                 from /home/christian/yaourt-tmp-christian/aur-mingw-w64-gcc/src/gcc-build-i686-w64-mingw32/i686-w64-mingw32/libstdc++-v3/include/string:52,
                 from /home/christian/yaourt-tmp-christian/aur-mingw-w64-gcc/src/gcc-build-i686-w64-mingw32/i686-w64-mingw32/libstdc++-v3/include/bits/locale_classes.h:40,
                 from /home/christian/yaourt-tmp-christian/aur-mingw-w64-gcc/src/gcc-build-i686-w64-mingw32/i686-w64-mingw32/libstdc++-v3/include/bits/ios_base.h:41,
                 from /home/christian/yaourt-tmp-christian/aur-mingw-w64-gcc/src/gcc-build-i686-w64-mingw32/i686-w64-mingw32/libstdc++-v3/include/ios:42,
                 from /home/christian/yaourt-tmp-christian/aur-mingw-w64-gcc/src/gcc-build-i686-w64-mingw32/i686-w64-mingw32/libstdc++-v3/include/istream:38,
                 from /home/christian/yaourt-tmp-christian/aur-mingw-w64-gcc/src/gcc-build-i686-w64-mingw32/i686-w64-mingw32/libstdc++-v3/include/sstream:38,
                 from /home/christian/yaourt-tmp-christian/aur-mingw-w64-gcc/src/gcc-build-i686-w64-mingw32/i686-w64-mingw32/libstdc++-v3/include/complex:45,
                 from /home/christian/yaourt-tmp-christian/aur-mingw-w64-gcc/src/gcc-build-i686-w64-mingw32/i686-w64-mingw32/libstdc++-v3/include/ccomplex:38,
                 from /home/christian/yaourt-tmp-christian/aur-mingw-w64-gcc/src/gcc-4.8.0/libstdc++-v3/include/precompiled/stdc++.h:52:
/home/christian/yaourt-tmp-christian/aur-mingw-w64-gcc/src/gcc-build-i686-w64-mingw32/i686-w64-mingw32/libstdc++-v3/include/ext/string_conversions.h:83:5: note: template<class _String, class _CharT> _String __gnu_cxx::__to_xstring(int (*)(_CharT*, std::size_t, const _CharT*, char*), std::size_t, const _CharT*, ...)
     __to_xstring(int (*__convf) (_CharT*, std::size_t, const _CharT*,
     ^
/home/christian/yaourt-tmp-christian/aur-mingw-w64-gcc/src/gcc-build-i686-w64-mingw32/i686-w64-mingw32/libstdc++-v3/include/ext/string_conversions.h:83:5: note:   template argument deduction/substitution failed:
In file included from /home/christian/yaourt-tmp-christian/aur-mingw-w64-gcc/src/gcc-build-i686-w64-mingw32/i686-w64-mingw32/libstdc++-v3/include/string:52:0,
                 from /home/christian/yaourt-tmp-christian/aur-mingw-w64-gcc/src/gcc-build-i686-w64-mingw32/i686-w64-mingw32/libstdc++-v3/include/bits/locale_classes.h:40,
                 from /home/christian/yaourt-tmp-christian/aur-mingw-w64-gcc/src/gcc-build-i686-w64-mingw32/i686-w64-mingw32/libstdc++-v3/include/bits/ios_base.h:41,
                 from /home/christian/yaourt-tmp-christian/aur-mingw-w64-gcc/src/gcc-build-i686-w64-mingw32/i686-w64-mingw32/libstdc++-v3/include/ios:42,
                 from /home/christian/yaourt-tmp-christian/aur-mingw-w64-gcc/src/gcc-build-i686-w64-mingw32/i686-w64-mingw32/libstdc++-v3/include/istream:38,
                 from /home/christian/yaourt-tmp-christian/aur-mingw-w64-gcc/src/gcc-build-i686-w64-mingw32/i686-w64-mingw32/libstdc++-v3/include/sstream:38,
                 from /home/christian/yaourt-tmp-christian/aur-mingw-w64-gcc/src/gcc-build-i686-w64-mingw32/i686-w64-mingw32/libstdc++-v3/include/complex:45,
                 from /home/christian/yaourt-tmp-christian/aur-mingw-w64-gcc/src/gcc-build-i686-w64-mingw32/i686-w64-mingw32/libstdc++-v3/include/ccomplex:38,
                 from /home/christian/yaourt-tmp-christian/aur-mingw-w64-gcc/src/gcc-4.8.0/libstdc++-v3/include/precompiled/stdc++.h:52:
/home/christian/yaourt-tmp-christian/aur-mingw-w64-gcc/src/gcc-build-i686-w64-mingw32/i686-w64-mingw32/libstdc++-v3/include/bits/basic_string.h:2992:24: note:   mismatched types 'std::size_t {aka unsigned int}' and 'const wchar_t*'
          L"%lld", __val); }
                        ^
/home/christian/yaourt-tmp-christian/aur-mingw-w64-gcc/src/gcc-build-i686-w64-mingw32/i686-w64-mingw32/libstdc++-v3/include/bits/basic_string.h: In function 'std::wstring std::to_wstring(long long unsigned int)':
/home/christian/yaourt-tmp-christian/aur-mingw-w64-gcc/src/gcc-build-i686-w64-mingw32/i686-w64-mingw32/libstdc++-v3/include/bits/basic_string.h:2998:24: error: no matching function for call to '__to_xstring(int (*)(wchar_t*, const wchar_t*, char*), unsigned int, const wchar_t [5], long long unsigned int&)'
          L"%llu", __val); }
                        ^
/home/christian/yaourt-tmp-christian/aur-mingw-w64-gcc/src/gcc-build-i686-w64-mingw32/i686-w64-mingw32/libstdc++-v3/include/bits/basic_string.h:2998:24: note: candidate is:
In file included from /home/christian/yaourt-tmp-christian/aur-mingw-w64-gcc/src/gcc-build-i686-w64-mingw32/i686-w64-mingw32/libstdc++-v3/include/bits/basic_string.h:2817:0,
                 from /home/christian/yaourt-tmp-christian/aur-mingw-w64-gcc/src/gcc-build-i686-w64-mingw32/i686-w64-mingw32/libstdc++-v3/include/string:52,
                 from /home/christian/yaourt-tmp-christian/aur-mingw-w64-gcc/src/gcc-build-i686-w64-mingw32/i686-w64-mingw32/libstdc++-v3/include/bits/locale_classes.h:40,
                 from /home/christian/yaourt-tmp-christian/aur-mingw-w64-gcc/src/gcc-build-i686-w64-mingw32/i686-w64-mingw32/libstdc++-v3/include/bits/ios_base.h:41,
                 from /home/christian/yaourt-tmp-christian/aur-mingw-w64-gcc/src/gcc-build-i686-w64-mingw32/i686-w64-mingw32/libstdc++-v3/include/ios:42,
                 from /home/christian/yaourt-tmp-christian/aur-mingw-w64-gcc/src/gcc-build-i686-w64-mingw32/i686-w64-mingw32/libstdc++-v3/include/istream:38,
                 from /home/christian/yaourt-tmp-christian/aur-mingw-w64-gcc/src/gcc-build-i686-w64-mingw32/i686-w64-mingw32/libstdc++-v3/include/sstream:38,
                 from /home/christian/yaourt-tmp-christian/aur-mingw-w64-gcc/src/gcc-build-i686-w64-mingw32/i686-w64-mingw32/libstdc++-v3/include/complex:45,
                 from /home/christian/yaourt-tmp-christian/aur-mingw-w64-gcc/src/gcc-build-i686-w64-mingw32/i686-w64-mingw32/libstdc++-v3/include/ccomplex:38,
                 from /home/christian/yaourt-tmp-christian/aur-mingw-w64-gcc/src/gcc-4.8.0/libstdc++-v3/include/precompiled/stdc++.h:52:
/home/christian/yaourt-tmp-christian/aur-mingw-w64-gcc/src/gcc-build-i686-w64-mingw32/i686-w64-mingw32/libstdc++-v3/include/ext/string_conversions.h:83:5: note: template<class _String, class _CharT> _String __gnu_cxx::__to_xstring(int (*)(_CharT*, std::size_t, const _CharT*, char*), std::size_t, const _CharT*, ...)
     __to_xstring(int (*__convf) (_CharT*, std::size_t, const _CharT*,
     ^
/home/christian/yaourt-tmp-christian/aur-mingw-w64-gcc/src/gcc-build-i686-w64-mingw32/i686-w64-mingw32/libstdc++-v3/include/ext/string_conversions.h:83:5: note:   template argument deduction/substitution failed:
In file included from /home/christian/yaourt-tmp-christian/aur-mingw-w64-gcc/src/gcc-build-i686-w64-mingw32/i686-w64-mingw32/libstdc++-v3/include/string:52:0,
                 from /home/christian/yaourt-tmp-christian/aur-mingw-w64-gcc/src/gcc-build-i686-w64-mingw32/i686-w64-mingw32/libstdc++-v3/include/bits/locale_classes.h:40,
                 from /home/christian/yaourt-tmp-christian/aur-mingw-w64-gcc/src/gcc-build-i686-w64-mingw32/i686-w64-mingw32/libstdc++-v3/include/bits/ios_base.h:41,
                 from /home/christian/yaourt-tmp-christian/aur-mingw-w64-gcc/src/gcc-build-i686-w64-mingw32/i686-w64-mingw32/libstdc++-v3/include/ios:42,
                 from /home/christian/yaourt-tmp-christian/aur-mingw-w64-gcc/src/gcc-build-i686-w64-mingw32/i686-w64-mingw32/libstdc++-v3/include/istream:38,
                 from /home/christian/yaourt-tmp-christian/aur-mingw-w64-gcc/src/gcc-build-i686-w64-mingw32/i686-w64-mingw32/libstdc++-v3/include/sstream:38,
                 from /home/christian/yaourt-tmp-christian/aur-mingw-w64-gcc/src/gcc-build-i686-w64-mingw32/i686-w64-mingw32/libstdc++-v3/include/complex:45,
                 from /home/christian/yaourt-tmp-christian/aur-mingw-w64-gcc/src/gcc-build-i686-w64-mingw32/i686-w64-mingw32/libstdc++-v3/include/ccomplex:38,
                 from /home/christian/yaourt-tmp-christian/aur-mingw-w64-gcc/src/gcc-4.8.0/libstdc++-v3/include/precompiled/stdc++.h:52:
/home/christian/yaourt-tmp-christian/aur-mingw-w64-gcc/src/gcc-build-i686-w64-mingw32/i686-w64-mingw32/libstdc++-v3/include/bits/basic_string.h:2998:24: note:   mismatched types 'std::size_t {aka unsigned int}' and 'const wchar_t*'
          L"%llu", __val); }
                        ^
/home/christian/yaourt-tmp-christian/aur-mingw-w64-gcc/src/gcc-build-i686-w64-mingw32/i686-w64-mingw32/libstdc++-v3/include/bits/basic_string.h: In function 'std::wstring std::to_wstring(float)':
/home/christian/yaourt-tmp-christian/aur-mingw-w64-gcc/src/gcc-build-i686-w64-mingw32/i686-w64-mingw32/libstdc++-v3/include/bits/basic_string.h:3006:22: error: no matching function for call to '__to_xstring(int (*)(wchar_t*, const wchar_t*, char*), const int&, const wchar_t [3], float&)'
          L"%f", __val);
                      ^
/home/christian/yaourt-tmp-christian/aur-mingw-w64-gcc/src/gcc-build-i686-w64-mingw32/i686-w64-mingw32/libstdc++-v3/include/bits/basic_string.h:3006:22: note: candidate is:
In file included from /home/christian/yaourt-tmp-christian/aur-mingw-w64-gcc/src/gcc-build-i686-w64-mingw32/i686-w64-mingw32/libstdc++-v3/include/bits/basic_string.h:2817:0,
                 from /home/christian/yaourt-tmp-christian/aur-mingw-w64-gcc/src/gcc-build-i686-w64-mingw32/i686-w64-mingw32/libstdc++-v3/include/string:52,
                 from /home/christian/yaourt-tmp-christian/aur-mingw-w64-gcc/src/gcc-build-i686-w64-mingw32/i686-w64-mingw32/libstdc++-v3/include/bits/locale_classes.h:40,
                 from /home/christian/yaourt-tmp-christian/aur-mingw-w64-gcc/src/gcc-build-i686-w64-mingw32/i686-w64-mingw32/libstdc++-v3/include/bits/ios_base.h:41,
                 from /home/christian/yaourt-tmp-christian/aur-mingw-w64-gcc/src/gcc-build-i686-w64-mingw32/i686-w64-mingw32/libstdc++-v3/include/ios:42,
                 from /home/christian/yaourt-tmp-christian/aur-mingw-w64-gcc/src/gcc-build-i686-w64-mingw32/i686-w64-mingw32/libstdc++-v3/include/istream:38,
                 from /home/christian/yaourt-tmp-christian/aur-mingw-w64-gcc/src/gcc-build-i686-w64-mingw32/i686-w64-mingw32/libstdc++-v3/include/sstream:38,
                 from /home/christian/yaourt-tmp-christian/aur-mingw-w64-gcc/src/gcc-build-i686-w64-mingw32/i686-w64-mingw32/libstdc++-v3/include/complex:45,
                 from /home/christian/yaourt-tmp-christian/aur-mingw-w64-gcc/src/gcc-build-i686-w64-mingw32/i686-w64-mingw32/libstdc++-v3/include/ccomplex:38,
                 from /home/christian/yaourt-tmp-christian/aur-mingw-w64-gcc/src/gcc-4.8.0/libstdc++-v3/include/precompiled/stdc++.h:52:
/home/christian/yaourt-tmp-christian/aur-mingw-w64-gcc/src/gcc-build-i686-w64-mingw32/i686-w64-mingw32/libstdc++-v3/include/ext/string_conversions.h:83:5: note: template<class _String, class _CharT> _String __gnu_cxx::__to_xstring(int (*)(_CharT*, std::size_t, const _CharT*, char*), std::size_t, const _CharT*, ...)
     __to_xstring(int (*__convf) (_CharT*, std::size_t, const _CharT*,
     ^
/home/christian/yaourt-tmp-christian/aur-mingw-w64-gcc/src/gcc-build-i686-w64-mingw32/i686-w64-mingw32/libstdc++-v3/include/ext/string_conversions.h:83:5: note:   template argument deduction/substitution failed:
In file included from /home/christian/yaourt-tmp-christian/aur-mingw-w64-gcc/src/gcc-build-i686-w64-mingw32/i686-w64-mingw32/libstdc++-v3/include/string:52:0,
                 from /home/christian/yaourt-tmp-christian/aur-mingw-w64-gcc/src/gcc-build-i686-w64-mingw32/i686-w64-mingw32/libstdc++-v3/include/bits/locale_classes.h:40,
                 from /home/christian/yaourt-tmp-christian/aur-mingw-w64-gcc/src/gcc-build-i686-w64-mingw32/i686-w64-mingw32/libstdc++-v3/include/bits/ios_base.h:41,
                 from /home/christian/yaourt-tmp-christian/aur-mingw-w64-gcc/src/gcc-build-i686-w64-mingw32/i686-w64-mingw32/libstdc++-v3/include/ios:42,
                 from /home/christian/yaourt-tmp-christian/aur-mingw-w64-gcc/src/gcc-build-i686-w64-mingw32/i686-w64-mingw32/libstdc++-v3/include/istream:38,
                 from /home/christian/yaourt-tmp-christian/aur-mingw-w64-gcc/src/gcc-build-i686-w64-mingw32/i686-w64-mingw32/libstdc++-v3/include/sstream:38,
                 from /home/christian/yaourt-tmp-christian/aur-mingw-w64-gcc/src/gcc-build-i686-w64-mingw32/i686-w64-mingw32/libstdc++-v3/include/complex:45,
                 from /home/christian/yaourt-tmp-christian/aur-mingw-w64-gcc/src/gcc-build-i686-w64-mingw32/i686-w64-mingw32/libstdc++-v3/include/ccomplex:38,
                 from /home/christian/yaourt-tmp-christian/aur-mingw-w64-gcc/src/gcc-4.8.0/libstdc++-v3/include/precompiled/stdc++.h:52:
/home/christian/yaourt-tmp-christian/aur-mingw-w64-gcc/src/gcc-build-i686-w64-mingw32/i686-w64-mingw32/libstdc++-v3/include/bits/basic_string.h:3006:22: note:   mismatched types 'std::size_t {aka unsigned int}' and 'const wchar_t*'
          L"%f", __val);
                      ^
/home/christian/yaourt-tmp-christian/aur-mingw-w64-gcc/src/gcc-build-i686-w64-mingw32/i686-w64-mingw32/libstdc++-v3/include/bits/basic_string.h: In function 'std::wstring std::to_wstring(double)':
/home/christian/yaourt-tmp-christian/aur-mingw-w64-gcc/src/gcc-build-i686-w64-mingw32/i686-w64-mingw32/libstdc++-v3/include/bits/basic_string.h:3015:22: error: no matching function for call to '__to_xstring(int (*)(wchar_t*, const wchar_t*, char*), const int&, const wchar_t [3], double&)'
          L"%f", __val);
                      ^
/home/christian/yaourt-tmp-christian/aur-mingw-w64-gcc/src/gcc-build-i686-w64-mingw32/i686-w64-mingw32/libstdc++-v3/include/bits/basic_string.h:3015:22: note: candidate is:
In file included from /home/christian/yaourt-tmp-christian/aur-mingw-w64-gcc/src/gcc-build-i686-w64-mingw32/i686-w64-mingw32/libstdc++-v3/include/bits/basic_string.h:2817:0,
                 from /home/christian/yaourt-tmp-christian/aur-mingw-w64-gcc/src/gcc-build-i686-w64-mingw32/i686-w64-mingw32/libstdc++-v3/include/string:52,
                 from /home/christian/yaourt-tmp-christian/aur-mingw-w64-gcc/src/gcc-build-i686-w64-mingw32/i686-w64-mingw32/libstdc++-v3/include/bits/locale_classes.h:40,
                 from /home/christian/yaourt-tmp-christian/aur-mingw-w64-gcc/src/gcc-build-i686-w64-mingw32/i686-w64-mingw32/libstdc++-v3/include/bits/ios_base.h:41,
                 from /home/christian/yaourt-tmp-christian/aur-mingw-w64-gcc/src/gcc-build-i686-w64-mingw32/i686-w64-mingw32/libstdc++-v3/include/ios:42,
                 from /home/christian/yaourt-tmp-christian/aur-mingw-w64-gcc/src/gcc-build-i686-w64-mingw32/i686-w64-mingw32/libstdc++-v3/include/istream:38,
                 from /home/christian/yaourt-tmp-christian/aur-mingw-w64-gcc/src/gcc-build-i686-w64-mingw32/i686-w64-mingw32/libstdc++-v3/include/sstream:38,
                 from /home/christian/yaourt-tmp-christian/aur-mingw-w64-gcc/src/gcc-build-i686-w64-mingw32/i686-w64-mingw32/libstdc++-v3/include/complex:45,
                 from /home/christian/yaourt-tmp-christian/aur-mingw-w64-gcc/src/gcc-build-i686-w64-mingw32/i686-w64-mingw32/libstdc++-v3/include/ccomplex:38,
                 from /home/christian/yaourt-tmp-christian/aur-mingw-w64-gcc/src/gcc-4.8.0/libstdc++-v3/include/precompiled/stdc++.h:52:
/home/christian/yaourt-tmp-christian/aur-mingw-w64-gcc/src/gcc-build-i686-w64-mingw32/i686-w64-mingw32/libstdc++-v3/include/ext/string_conversions.h:83:5: note: template<class _String, class _CharT> _String __gnu_cxx::__to_xstring(int (*)(_CharT*, std::size_t, const _CharT*, char*), std::size_t, const _CharT*, ...)
     __to_xstring(int (*__convf) (_CharT*, std::size_t, const _CharT*,
     ^
/home/christian/yaourt-tmp-christian/aur-mingw-w64-gcc/src/gcc-build-i686-w64-mingw32/i686-w64-mingw32/libstdc++-v3/include/ext/string_conversions.h:83:5: note:   template argument deduction/substitution failed:
In file included from /home/christian/yaourt-tmp-christian/aur-mingw-w64-gcc/src/gcc-build-i686-w64-mingw32/i686-w64-mingw32/libstdc++-v3/include/string:52:0,
                 from /home/christian/yaourt-tmp-christian/aur-mingw-w64-gcc/src/gcc-build-i686-w64-mingw32/i686-w64-mingw32/libstdc++-v3/include/bits/locale_classes.h:40,
                 from /home/christian/yaourt-tmp-christian/aur-mingw-w64-gcc/src/gcc-build-i686-w64-mingw32/i686-w64-mingw32/libstdc++-v3/include/bits/ios_base.h:41,
                 from /home/christian/yaourt-tmp-christian/aur-mingw-w64-gcc/src/gcc-build-i686-w64-mingw32/i686-w64-mingw32/libstdc++-v3/include/ios:42,
                 from /home/christian/yaourt-tmp-christian/aur-mingw-w64-gcc/src/gcc-build-i686-w64-mingw32/i686-w64-mingw32/libstdc++-v3/include/istream:38,
                 from /home/christian/yaourt-tmp-christian/aur-mingw-w64-gcc/src/gcc-build-i686-w64-mingw32/i686-w64-mingw32/libstdc++-v3/include/sstream:38,
                 from /home/christian/yaourt-tmp-christian/aur-mingw-w64-gcc/src/gcc-build-i686-w64-mingw32/i686-w64-mingw32/libstdc++-v3/include/complex:45,
                 from /home/christian/yaourt-tmp-christian/aur-mingw-w64-gcc/src/gcc-build-i686-w64-mingw32/i686-w64-mingw32/libstdc++-v3/include/ccomplex:38,
                 from /home/christian/yaourt-tmp-christian/aur-mingw-w64-gcc/src/gcc-4.8.0/libstdc++-v3/include/precompiled/stdc++.h:52:
/home/christian/yaourt-tmp-christian/aur-mingw-w64-gcc/src/gcc-build-i686-w64-mingw32/i686-w64-mingw32/libstdc++-v3/include/bits/basic_string.h:3015:22: note:   mismatched types 'std::size_t {aka unsigned int}' and 'const wchar_t*'
          L"%f", __val);
                      ^
/home/christian/yaourt-tmp-christian/aur-mingw-w64-gcc/src/gcc-build-i686-w64-mingw32/i686-w64-mingw32/libstdc++-v3/include/bits/basic_string.h: In function 'std::wstring std::to_wstring(long double)':
/home/christian/yaourt-tmp-christian/aur-mingw-w64-gcc/src/gcc-build-i686-w64-mingw32/i686-w64-mingw32/libstdc++-v3/include/bits/basic_string.h:3024:23: error: no matching function for call to '__to_xstring(int (*)(wchar_t*, const wchar_t*, char*), const int&, const wchar_t [4], long double&)'
          L"%Lf", __val);
                       ^
/home/christian/yaourt-tmp-christian/aur-mingw-w64-gcc/src/gcc-build-i686-w64-mingw32/i686-w64-mingw32/libstdc++-v3/include/bits/basic_string.h:3024:23: note: candidate is:
In file included from /home/christian/yaourt-tmp-christian/aur-mingw-w64-gcc/src/gcc-build-i686-w64-mingw32/i686-w64-mingw32/libstdc++-v3/include/bits/basic_string.h:2817:0,
                 from /home/christian/yaourt-tmp-christian/aur-mingw-w64-gcc/src/gcc-build-i686-w64-mingw32/i686-w64-mingw32/libstdc++-v3/include/string:52,
                 from /home/christian/yaourt-tmp-christian/aur-mingw-w64-gcc/src/gcc-build-i686-w64-mingw32/i686-w64-mingw32/libstdc++-v3/include/bits/locale_classes.h:40,
                 from /home/christian/yaourt-tmp-christian/aur-mingw-w64-gcc/src/gcc-build-i686-w64-mingw32/i686-w64-mingw32/libstdc++-v3/include/bits/ios_base.h:41,
                 from /home/christian/yaourt-tmp-christian/aur-mingw-w64-gcc/src/gcc-build-i686-w64-mingw32/i686-w64-mingw32/libstdc++-v3/include/ios:42,
                 from /home/christian/yaourt-tmp-christian/aur-mingw-w64-gcc/src/gcc-build-i686-w64-mingw32/i686-w64-mingw32/libstdc++-v3/include/istream:38,
                 from /home/christian/yaourt-tmp-christian/aur-mingw-w64-gcc/src/gcc-build-i686-w64-mingw32/i686-w64-mingw32/libstdc++-v3/include/sstream:38,
                 from /home/christian/yaourt-tmp-christian/aur-mingw-w64-gcc/src/gcc-build-i686-w64-mingw32/i686-w64-mingw32/libstdc++-v3/include/complex:45,
                 from /home/christian/yaourt-tmp-christian/aur-mingw-w64-gcc/src/gcc-build-i686-w64-mingw32/i686-w64-mingw32/libstdc++-v3/include/ccomplex:38,
                 from /home/christian/yaourt-tmp-christian/aur-mingw-w64-gcc/src/gcc-4.8.0/libstdc++-v3/include/precompiled/stdc++.h:52:
/home/christian/yaourt-tmp-christian/aur-mingw-w64-gcc/src/gcc-build-i686-w64-mingw32/i686-w64-mingw32/libstdc++-v3/include/ext/string_conversions.h:83:5: note: template<class _String, class _CharT> _String __gnu_cxx::__to_xstring(int (*)(_CharT*, std::size_t, const _CharT*, char*), std::size_t, const _CharT*, ...)
     __to_xstring(int (*__convf) (_CharT*, std::size_t, const _CharT*,
     ^
/home/christian/yaourt-tmp-christian/aur-mingw-w64-gcc/src/gcc-build-i686-w64-mingw32/i686-w64-mingw32/libstdc++-v3/include/ext/string_conversions.h:83:5: note:   template argument deduction/substitution failed:
In file included from /home/christian/yaourt-tmp-christian/aur-mingw-w64-gcc/src/gcc-build-i686-w64-mingw32/i686-w64-mingw32/libstdc++-v3/include/string:52:0,
                 from /home/christian/yaourt-tmp-christian/aur-mingw-w64-gcc/src/gcc-build-i686-w64-mingw32/i686-w64-mingw32/libstdc++-v3/include/bits/locale_classes.h:40,
                 from /home/christian/yaourt-tmp-christian/aur-mingw-w64-gcc/src/gcc-build-i686-w64-mingw32/i686-w64-mingw32/libstdc++-v3/include/bits/ios_base.h:41,
                 from /home/christian/yaourt-tmp-christian/aur-mingw-w64-gcc/src/gcc-build-i686-w64-mingw32/i686-w64-mingw32/libstdc++-v3/include/ios:42,
                 from /home/christian/yaourt-tmp-christian/aur-mingw-w64-gcc/src/gcc-build-i686-w64-mingw32/i686-w64-mingw32/libstdc++-v3/include/istream:38,
                 from /home/christian/yaourt-tmp-christian/aur-mingw-w64-gcc/src/gcc-build-i686-w64-mingw32/i686-w64-mingw32/libstdc++-v3/include/sstream:38,
                 from /home/christian/yaourt-tmp-christian/aur-mingw-w64-gcc/src/gcc-build-i686-w64-mingw32/i686-w64-mingw32/libstdc++-v3/include/complex:45,
                 from /home/christian/yaourt-tmp-christian/aur-mingw-w64-gcc/src/gcc-build-i686-w64-mingw32/i686-w64-mingw32/libstdc++-v3/include/ccomplex:38,
                 from /home/christian/yaourt-tmp-christian/aur-mingw-w64-gcc/src/gcc-4.8.0/libstdc++-v3/include/precompiled/stdc++.h:52:
/home/christian/yaourt-tmp-christian/aur-mingw-w64-gcc/src/gcc-build-i686-w64-mingw32/i686-w64-mingw32/libstdc++-v3/include/bits/basic_string.h:3024:23: note:   mismatched types 'std::size_t {aka unsigned int}' and 'const wchar_t*'
          L"%Lf", __val);
                       ^
make[4]: *** [i686-w64-mingw32/bits/stdc++.h.gch/O2ggnu++0x.gch] Error 1
make[4]: Leaving directory `/home/christian/yaourt-tmp-christian/aur-mingw-w64-gcc/src/gcc-build-i686-w64-mingw32/i686-w64-mingw32/libstdc++-v3/include'
make[3]: *** [all-recursive] Error 1
make[3]: Leaving directory `/home/christian/yaourt-tmp-christian/aur-mingw-w64-gcc/src/gcc-build-i686-w64-mingw32/i686-w64-mingw32/libstdc++-v3'
make[2]: *** [all] Error 2
make[2]: Leaving directory `/home/christian/yaourt-tmp-christian/aur-mingw-w64-gcc/src/gcc-build-i686-w64-mingw32/i686-w64-mingw32/libstdc++-v3'
make[1]: *** [all-target-libstdc++-v3] Error 2
make[1]: Leaving directory `/home/christian/yaourt-tmp-christian/aur-mingw-w64-gcc/src/gcc-build-i686-w64-mingw32'
make: *** [all] Error 2