[INFO ]  =================================================================
[INFO ]  Installing PPL
[EXTRA]    Configuring PPL
[EXTRA]    Building PPL
[ERROR]    /tmp/rbdev-build/build-ypr0/.build/src/ppl-0.10.2/src/Interval.defs.hh:451:86: error: 'f_info' was not declared in this scope, and no declarations were found by argument-dependent lookup at the point of instantiation [-fpermissive]
[ERROR]    /tmp/rbdev-build/build-ypr0/.build/src/ppl-0.10.2/src/Interval.defs.hh:390:86: error: 'f_info' was not declared in this scope, and no declarations were found by argument-dependent lookup at the point of instantiation [-fpermissive]
[ERROR]    /tmp/rbdev-build/build-ypr0/.build/src/ppl-0.10.2/src/Interval.defs.hh:432:5: error: 'f_info' was not declared in this scope, and no declarations were found by argument-dependent lookup at the point of instantiation [-fpermissive]
[ERROR]    /tmp/rbdev-build/build-ypr0/.build/src/ppl-0.10.2/src/Interval.defs.hh:492:5: error: 'f_info' was not declared in this scope, and no declarations were found by argument-dependent lookup at the point of instantiation [-fpermissive]
[ERROR]    /tmp/rbdev-build/build-ypr0/.build/src/ppl-0.10.2/src/Interval.defs.hh:390:86: error: 'f_info' was not declared in this scope, and no declarations were found by argument-dependent lookup at the point of instantiation [-fpermissive]
[ERROR]    /tmp/rbdev-build/build-ypr0/.build/src/ppl-0.10.2/src/Interval.defs.hh:451:86: error: 'f_info' was not declared in this scope, and no declarations were found by argument-dependent lookup at the point of instantiation [-fpermissive]
[ERROR]    make[4]: *** [Polyhedron_widenings.lo] Error 1
[ERROR]    make[3]: *** [all] Error 2
[ERROR]    make[2]: *** [all-recursive] Error 1
[ERROR]    make[1]: *** [all] Error 2
[ERROR]
[ERROR]    >>
[ERROR]    >>  Error happened in: main[scripts/crosstool-NG.sh]
[ERROR]    >>
[ERROR]    >>  There is a list of known issues, some with workarounds, in:
[ERROR]    >>      '/home/rockbox/toolchain/share/doc/ct-ng-1.13.2/B - Known issues.txt'
[ERROR]
[ERROR]    Build failed in step 'Extracting and patching toolchain components'
[ERROR]
[ERROR]    (elapsed: 6:24.40)
[06:24] / make: *** [build] Error 2