/root/rockbox/tools/telechips.c: In function `gentable':
/root/rockbox/tools/telechips.c:60: warning: declaration of `index' shadows a global declaration
<built-in>:0: warning: shadowed declaration is here
/root/rockbox/tools/telechips.c: In function `gentable':
/root/rockbox/tools/telechips.c:60: warning: declaration of `index' shadows a global declaration
<built-in>:0: warning: shadowed declaration is here
/root/rockbox/apps/plugins/theme_remove.c: In function 'set_file_name':
/root/rockbox/apps/plugins/theme_remove.c:226: error: 'struct plugin_api' has no member named 'strncpy'
/root/rockbox/apps/plugins/theme_remove.c:230: error: 'struct plugin_api' has no member named 'strncpy'
/root/rockbox/apps/plugins/theme_remove.c: In function 'remove_icons':
/root/rockbox/apps/plugins/theme_remove.c:312: error: 'struct plugin_api' has no member named 'strncpy'
/root/rockbox/apps/plugins/theme_remove.c: In function 'plugin_start':
/root/rockbox/apps/plugins/theme_remove.c:673: error: 'struct plugin_api' has no member named 'strncpy'
make: *** [/root/rockbox/gig/apps/plugins/theme_remove.o] Error 1