1
2
3
4
/root/rockbox/apps/plugins/jpeg/jpeg.c: In function 'scroll_bmp':
/root/rockbox/apps/plugins/jpeg/jpeg.c:631: error: duplicate case value
/root/rockbox/apps/plugins/jpeg/jpeg.c:621: error: previously used here
make: *** [/root/rockbox/sansa/apps/plugins/jpeg/jpeg.o] Error