[INFO] 
[INFO] --- maven-clean-plugin:2.3:clean (default-clean) @ core ---
[INFO] 
[INFO] --- maven-apt-plugin:1.0.2:process (default) @ core ---
[ERROR] execute error
java.lang.RuntimeException: java.lang.IndexOutOfBoundsException: -1
	at com.sun.tools.javac.main.Main.compile(Main.java:469)
	at com.sun.tools.javac.api.JavacTaskImpl.call(JavacTaskImpl.java:132)
	at com.mysema.maven.apt.AbstractProcessorMojo.execute(AbstractProcessorMojo.java:210)
	at org.apache.maven.plugin.DefaultBuildPluginManager.executeMojo(DefaultBuildPluginManager.java:101)
	at org.apache.maven.lifecycle.internal.MojoExecutor.execute(MojoExecutor.java:209)
	at org.apache.maven.lifecycle.internal.MojoExecutor.execute(MojoExecutor.java:153)
	at org.apache.maven.lifecycle.internal.MojoExecutor.execute(MojoExecutor.java:145)
	at org.apache.maven.lifecycle.internal.LifecycleModuleBuilder.buildProject(LifecycleModuleBuilder.java:84)
	at org.apache.maven.lifecycle.internal.LifecycleModuleBuilder.buildProject(LifecycleModuleBuilder.java:59)
	at org.apache.maven.lifecycle.internal.LifecycleStarter.singleThreadedBuild(LifecycleStarter.java:183)
	at org.apache.maven.lifecycle.internal.LifecycleStarter.execute(LifecycleStarter.java:161)
	at org.apache.maven.DefaultMaven.doExecute(DefaultMaven.java:320)
	at org.apache.maven.DefaultMaven.execute(DefaultMaven.java:156)
	at org.apache.maven.cli.MavenCli.execute(MavenCli.java:537)
	at org.apache.maven.cli.MavenCli.doMain(MavenCli.java:196)
	at org.apache.maven.cli.MavenCli.main(MavenCli.java:141)
	at sun.reflect.NativeMethodAccessorImpl.invoke0(Native Method)
	at sun.reflect.NativeMethodAccessorImpl.invoke(NativeMethodAccessorImpl.java:57)
	at sun.reflect.DelegatingMethodAccessorImpl.invoke(DelegatingMethodAccessorImpl.java:43)
	at java.lang.reflect.Method.invoke(Method.java:601)
	at org.codehaus.plexus.classworlds.launcher.Launcher.launchEnhanced(Launcher.java:290)
	at org.codehaus.plexus.classworlds.launcher.Launcher.launch(Launcher.java:230)
	at org.codehaus.plexus.classworlds.launcher.Launcher.mainWithExitCode(Launcher.java:409)
	at org.codehaus.plexus.classworlds.launcher.Launcher.main(Launcher.java:352)
	at org.codehaus.classworlds.Launcher.main(Launcher.java:47)
	at sun.reflect.NativeMethodAccessorImpl.invoke0(Native Method)
	at sun.reflect.NativeMethodAccessorImpl.invoke(NativeMethodAccessorImpl.java:57)
	at sun.reflect.DelegatingMethodAccessorImpl.invoke(DelegatingMethodAccessorImpl.java:43)
	at java.lang.reflect.Method.invoke(Method.java:601)
	at com.intellij.rt.execution.application.AppMain.main(AppMain.java:120)
Caused by: java.lang.IndexOutOfBoundsException: -1
	at com.sun.tools.javac.util.List.get(List.java:414)
	at com.mysema.query.apt.TypeExtractor.visitDeclared(TypeExtractor.java:62)
	at com.mysema.query.apt.TypeExtractor.visitDeclared(TypeExtractor.java:32)
	at com.sun.tools.javac.code.Type$ClassType.accept(Type.java:731)
	at javax.lang.model.util.AbstractTypeVisitor6.visit(AbstractTypeVisitor6.java:95)
	at com.mysema.query.apt.AbstractQuerydslProcessor.processFromProperties(AbstractQuerydslProcessor.java:338)
	at com.mysema.query.apt.AbstractQuerydslProcessor.getTypeFromProperties(AbstractQuerydslProcessor.java:308)
	at com.mysema.query.apt.AbstractQuerydslProcessor.collectElements(AbstractQuerydslProcessor.java:220)
	at com.mysema.query.apt.AbstractQuerydslProcessor.processAnnotations(AbstractQuerydslProcessor.java:118)
	at com.mysema.query.apt.AbstractQuerydslProcessor.process(AbstractQuerydslProcessor.java:104)
	at com.sun.tools.javac.processing.JavacProcessingEnvironment.callProcessor(JavacProcessingEnvironment.java:793)
	at com.sun.tools.javac.processing.JavacProcessingEnvironment.discoverAndRunProcs(JavacProcessingEnvironment.java:722)
	at com.sun.tools.javac.processing.JavacProcessingEnvironment.access$1700(JavacProcessingEnvironment.java:97)
	at com.sun.tools.javac.processing.JavacProcessingEnvironment$Round.run(JavacProcessingEnvironment.java:1029)
	at com.sun.tools.javac.processing.JavacProcessingEnvironment.doProcessing(JavacProcessingEnvironment.java:1163)
	at com.sun.tools.javac.main.JavaCompiler.processAnnotations(JavaCompiler.java:1108)
	at com.sun.tools.javac.main.JavaCompiler.compile(JavaCompiler.java:824)
	at com.sun.tools.javac.main.Main.compile(Main.java:439)
	... 29 more
[INFO] ------------------------------------------------------------------------
[INFO] BUILD FAILURE
[INFO] ------------------------------------------------------------------------
[INFO] Total time: 9.713s
[INFO] Finished at: Mon Nov 19 22:57:18 GMT 2012
[INFO] Final Memory: 18M/166M
[INFO] ------------------------------------------------------------------------
[ERROR] Failed to execute goal com.mysema.maven:maven-apt-plugin:1.0.2:process (default) on project core: java.lang.IndexOutOfBoundsException: -1 -> [Help 1]
[ERROR] 
[ERROR] To see the full stack trace of the errors, re-run Maven with the -e switch.
[ERROR] Re-run Maven using the -X switch to enable full debug logging.
[ERROR] 
[ERROR] For more information about the errors and possible solutions, please read the following articles:
[ERROR] [Help 1] http://cwiki.apache.org/confluence/display/MAVEN/MojoExecutionException