/media/data/rockbox/devenvironment/apps/plugins/sncviewer.c:1: error: expected ‘=’, ‘,’, ‘;’, ‘asm’ or ‘__attribute__’ before ‘:’ token
/media/data/rockbox/devenvironment/apps/plugins/sncviewer.c:5: error: stray ‘@’ in program
/media/data/rockbox/devenvironment/apps/plugins/sncviewer.c:5: error: stray ‘@’ in program
/media/data/rockbox/devenvironment/apps/plugins/sncviewer.c:5: error: stray ‘@’ in program
/media/data/rockbox/devenvironment/apps/plugins/sncviewer.c:5: error: stray ‘@’ in program
/media/data/rockbox/devenvironment/apps/plugins/sncviewer.c:17: error: stray ‘@’ in program
/media/data/rockbox/devenvironment/apps/plugins/sncviewer.c:17: error: stray ‘@’ in program
/media/data/rockbox/devenvironment/apps/plugins/sncviewer.c:17: error: stray ‘@’ in program
/media/data/rockbox/devenvironment/apps/plugins/sncviewer.c:17: error: stray ‘@’ in program
/media/data/rockbox/devenvironment/apps/plugins/sncviewer.c:18: error: stray ‘#’ in program
/media/data/rockbox/devenvironment/apps/plugins/sncviewer.c:19: error: stray ‘#’ in program
/media/data/rockbox/devenvironment/apps/plugins/sncviewer.c:24: error: stray ‘#’ in program
/media/data/rockbox/devenvironment/apps/plugins/sncviewer.c:25: error: stray ‘#’ in program
/media/data/rockbox/devenvironment/apps/plugins/sncviewer.c:26: error: stray ‘#’ in program
/media/data/rockbox/devenvironment/apps/plugins/sncviewer.c:27: error: stray ‘#’ in program
/media/data/rockbox/devenvironment/apps/plugins/sncviewer.c:28: error: stray ‘#’ in program
/media/data/rockbox/devenvironment/apps/plugins/sncviewer.c:29: error: stray ‘#’ in program
/media/data/rockbox/devenvironment/apps/plugins/sncviewer.c:30: error: stray ‘#’ in program
/media/data/rockbox/devenvironment/apps/plugins/sncviewer.c:31: error: stray ‘#’ in program
/media/data/rockbox/devenvironment/apps/plugins/sncviewer.c:32: error: stray ‘#’ in program
/media/data/rockbox/devenvironment/apps/plugins/sncviewer.c:33: error: stray ‘#’ in program
/media/data/rockbox/devenvironment/apps/plugins/sncviewer.c:34: error: stray ‘#’ in program
/media/data/rockbox/devenvironment/apps/plugins/sncviewer.c:35: error: stray ‘#’ in program
/media/data/rockbox/devenvironment/apps/plugins/sncviewer.c:36: error: stray ‘#’ in program
/media/data/rockbox/devenvironment/apps/plugins/sncviewer.c:38: error: stray ‘#’ in program
/media/data/rockbox/devenvironment/apps/plugins/sncviewer.c:39: error: stray ‘#’ in program
/media/data/rockbox/devenvironment/apps/plugins/sncviewer.c:40: error: stray ‘#’ in program
/media/data/rockbox/devenvironment/apps/plugins/sncviewer.c:41: error: stray ‘#’ in program
/media/data/rockbox/devenvironment/apps/plugins/sncviewer.c:42: error: stray ‘#’ in program
/media/data/rockbox/devenvironment/apps/plugins/sncviewer.c:43: error: stray ‘#’ in program
/media/data/rockbox/devenvironment/apps/plugins/sncviewer.c:44: error: stray ‘#’ in program
/media/data/rockbox/devenvironment/apps/plugins/sncviewer.c:45: error: stray ‘#’ in program
/media/data/rockbox/devenvironment/apps/plugins/sncviewer.c:46: error: stray ‘#’ in program
/media/data/rockbox/devenvironment/apps/plugins/sncviewer.c:47: error: stray ‘#’ in program
/media/data/rockbox/devenvironment/apps/plugins/sncviewer.c:49: error: stray ‘#’ in program
/media/data/rockbox/devenvironment/apps/plugins/sncviewer.c:50: error: stray ‘#’ in program
/media/data/rockbox/devenvironment/apps/plugins/sncviewer.c:51: error: stray ‘#’ in program
/media/data/rockbox/devenvironment/apps/plugins/sncviewer.c:52: error: stray ‘#’ in program
/media/data/rockbox/devenvironment/apps/plugins/sncviewer.c:53: error: stray ‘#’ in program
/media/data/rockbox/devenvironment/apps/plugins/sncviewer.c:54: error: stray ‘#’ in program
/media/data/rockbox/devenvironment/apps/plugins/sncviewer.c:55: error: stray ‘#’ in program
/media/data/rockbox/devenvironment/apps/plugins/sncviewer.c:57: error: stray ‘#’ in program
/media/data/rockbox/devenvironment/apps/plugins/sncviewer.c:60: error: stray ‘#’ in program
/media/data/rockbox/devenvironment/apps/plugins/sncviewer.c:61: error: stray ‘#’ in program
/media/data/rockbox/devenvironment/apps/plugins/sncviewer.c:62: error: stray ‘#’ in program
/media/data/rockbox/devenvironment/apps/plugins/sncviewer.c:63: error: stray ‘#’ in program
/media/data/rockbox/devenvironment/apps/plugins/sncviewer.c:64: error: stray ‘#’ in program
/media/data/rockbox/devenvironment/apps/plugins/sncviewer.c:65: error: stray ‘#’ in program
/media/data/rockbox/devenvironment/apps/plugins/sncviewer.c:66: error: stray ‘#’ in program
/media/data/rockbox/devenvironment/apps/plugins/sncviewer.c:67: error: stray ‘#’ in program
/media/data/rockbox/devenvironment/apps/plugins/sncviewer.c:74: error: expected identifier or ‘(’ before ‘+’ token
/media/data/rockbox/devenvironment/apps/plugins/sncviewer.c:74: error: stray ‘#’ in program
/media/data/rockbox/devenvironment/apps/plugins/sncviewer.c:75: error: stray ‘#’ in program
/media/data/rockbox/devenvironment/apps/plugins/sncviewer.c:76: error: stray ‘#’ in program
/media/data/rockbox/devenvironment/apps/plugins/sncviewer.c:77: error: stray ‘#’ in program
/media/data/rockbox/devenvironment/apps/plugins/sncviewer.c:78: error: stray ‘#’ in program
/media/data/rockbox/devenvironment/apps/plugins/sncviewer.c:79: error: stray ‘#’ in program
/media/data/rockbox/devenvironment/apps/plugins/sncviewer.c:80: error: stray ‘#’ in program
/media/data/rockbox/devenvironment/apps/plugins/sncviewer.c:81: error: stray ‘#’ in program
/media/data/rockbox/devenvironment/apps/plugins/sncviewer.c:82: error: stray ‘#’ in program
/media/data/rockbox/devenvironment/apps/plugins/sncviewer.c:83: error: stray ‘#’ in program
/media/data/rockbox/devenvironment/apps/plugins/sncviewer.c:84: error: stray ‘#’ in program
/media/data/rockbox/devenvironment/apps/plugins/sncviewer.c:85: error: stray ‘#’ in program
/media/data/rockbox/devenvironment/apps/plugins/sncviewer.c:86: error: stray ‘#’ in program
/media/data/rockbox/devenvironment/apps/plugins/sncviewer.c:92: error: expected identifier or ‘(’ before ‘+’ token
/media/data/rockbox/devenvironment/apps/plugins/sncviewer.c:97: error: expected identifier or ‘(’ before ‘+’ token
/media/data/rockbox/devenvironment/apps/plugins/sncviewer.c:116: error: expected identifier or ‘(’ before ‘+’ token
/media/data/rockbox/devenvironment/apps/plugins/sncviewer.c:117: error: expected identifier or ‘(’ before ‘+’ token
/media/data/rockbox/devenvironment/apps/plugins/sncviewer.c:118: error: stray ‘#’ in program
/media/data/rockbox/devenvironment/apps/plugins/sncviewer.c:119: error: stray ‘#’ in program
/media/data/rockbox/devenvironment/apps/plugins/sncviewer.c:121: error: stray ‘#’ in program
/media/data/rockbox/devenvironment/apps/plugins/sncviewer.c:122: error: stray ‘#’ in program
/media/data/rockbox/devenvironment/apps/plugins/sncviewer.c:123: error: stray ‘#’ in program
/media/data/rockbox/devenvironment/apps/plugins/sncviewer.c:124: error: stray ‘#’ in program
/media/data/rockbox/devenvironment/apps/plugins/sncviewer.c:125: error: stray ‘#’ in program
/media/data/rockbox/devenvironment/apps/plugins/sncviewer.c:126: error: stray ‘#’ in program
/media/data/rockbox/devenvironment/apps/plugins/sncviewer.c:127: error: stray ‘#’ in program
/media/data/rockbox/devenvironment/apps/plugins/sncviewer.c:128: error: stray ‘#’ in program
/media/data/rockbox/devenvironment/apps/plugins/sncviewer.c:129: error: stray ‘#’ in program
/media/data/rockbox/devenvironment/apps/plugins/sncviewer.c:130: error: stray ‘#’ in program
/media/data/rockbox/devenvironment/apps/plugins/sncviewer.c:131: error: stray ‘#’ in program
/media/data/rockbox/devenvironment/apps/plugins/sncviewer.c:132: error: stray ‘#’ in program
/media/data/rockbox/devenvironment/apps/plugins/sncviewer.c:133: error: stray ‘#’ in program
/media/data/rockbox/devenvironment/apps/plugins/sncviewer.c:134: error: stray ‘#’ in program
/media/data/rockbox/devenvironment/apps/plugins/sncviewer.c:135: error: stray ‘#’ in program
/media/data/rockbox/devenvironment/apps/plugins/sncviewer.c:136: error: stray ‘#’ in program
/media/data/rockbox/devenvironment/apps/plugins/sncviewer.c:137: error: stray ‘#’ in program
/media/data/rockbox/devenvironment/apps/plugins/sncviewer.c:138: error: stray ‘#’ in program
/media/data/rockbox/devenvironment/apps/plugins/sncviewer.c:139: error: stray ‘#’ in program
/media/data/rockbox/devenvironment/apps/plugins/sncviewer.c:140: error: stray ‘#’ in program
/media/data/rockbox/devenvironment/apps/plugins/sncviewer.c:141: error: stray ‘#’ in program
/media/data/rockbox/devenvironment/apps/plugins/sncviewer.c:142: error: stray ‘#’ in program
/media/data/rockbox/devenvironment/apps/plugins/sncviewer.c:143: error: stray ‘#’ in program
/media/data/rockbox/devenvironment/apps/plugins/sncviewer.c:146: error: stray ‘#’ in program
/media/data/rockbox/devenvironment/apps/plugins/sncviewer.c:147: error: stray ‘#’ in program
/media/data/rockbox/devenvironment/apps/plugins/sncviewer.c:148: error: stray ‘#’ in program
/media/data/rockbox/devenvironment/apps/plugins/sncviewer.c:149: error: stray ‘#’ in program
/media/data/rockbox/devenvironment/apps/plugins/sncviewer.c:150: error: stray ‘#’ in program
/media/data/rockbox/devenvironment/apps/plugins/sncviewer.c:151: error: stray ‘#’ in program
/media/data/rockbox/devenvironment/apps/plugins/sncviewer.c:152: error: stray ‘#’ in program
/media/data/rockbox/devenvironment/apps/plugins/sncviewer.c:153: error: stray ‘#’ in program
/media/data/rockbox/devenvironment/apps/plugins/sncviewer.c:154: error: stray ‘#’ in program
/media/data/rockbox/devenvironment/apps/plugins/sncviewer.c:155: error: stray ‘#’ in program
/media/data/rockbox/devenvironment/apps/plugins/sncviewer.c:157: error: stray ‘#’ in program
/media/data/rockbox/devenvironment/apps/plugins/sncviewer.c:158: error: stray ‘#’ in program
/media/data/rockbox/devenvironment/apps/plugins/sncviewer.c:159: error: stray ‘#’ in program
/media/data/rockbox/devenvironment/apps/plugins/sncviewer.c:160: error: stray ‘#’ in program
/media/data/rockbox/devenvironment/apps/plugins/sncviewer.c:161: error: stray ‘#’ in program
/media/data/rockbox/devenvironment/apps/plugins/sncviewer.c:162: error: stray ‘#’ in program
/media/data/rockbox/devenvironment/apps/plugins/sncviewer.c:164: error: stray ‘#’ in program
/media/data/rockbox/devenvironment/apps/plugins/sncviewer.c:165: error: stray ‘#’ in program
/media/data/rockbox/devenvironment/apps/plugins/sncviewer.c:167: error: stray ‘#’ in program
/media/data/rockbox/devenvironment/apps/plugins/sncviewer.c:169: error: stray ‘#’ in program
/media/data/rockbox/devenvironment/apps/plugins/sncviewer.c:170: error: stray ‘#’ in program
/media/data/rockbox/devenvironment/apps/plugins/sncviewer.c:171: error: stray ‘#’ in program
/media/data/rockbox/devenvironment/apps/plugins/sncviewer.c:172: error: stray ‘#’ in program
/media/data/rockbox/devenvironment/apps/plugins/sncviewer.c:173: error: stray ‘#’ in program
/media/data/rockbox/devenvironment/apps/plugins/sncviewer.c:175: error: stray ‘#’ in program
/media/data/rockbox/devenvironment/apps/plugins/sncviewer.c:176: error: stray ‘#’ in program
/media/data/rockbox/devenvironment/apps/plugins/sncviewer.c:177: error: stray ‘#’ in program
/media/data/rockbox/devenvironment/apps/plugins/sncviewer.c:178: error: stray ‘#’ in program
/media/data/rockbox/devenvironment/apps/plugins/sncviewer.c:180: error: stray ‘#’ in program
/media/data/rockbox/devenvironment/apps/plugins/sncviewer.c:181: error: expected identifier or ‘(’ before ‘+’ token
/media/data/rockbox/devenvironment/apps/plugins/sncviewer.c:181: error: stray ‘#’ in program
/media/data/rockbox/devenvironment/apps/plugins/sncviewer.c:183: error: expected identifier or ‘(’ before ‘+’ token
/media/data/rockbox/devenvironment/apps/plugins/sncviewer.c:183: error: stray ‘#’ in program
/media/data/rockbox/devenvironment/apps/plugins/sncviewer.c:185: error: expected identifier or ‘(’ before ‘+’ token
/media/data/rockbox/devenvironment/apps/plugins/sncviewer.c:186: error: stray ‘#’ in program
/media/data/rockbox/devenvironment/apps/plugins/sncviewer.c:187: error: stray ‘#’ in program
/media/data/rockbox/devenvironment/apps/plugins/sncviewer.c:188: error: stray ‘#’ in program
/media/data/rockbox/devenvironment/apps/plugins/sncviewer.c:189: error: stray ‘#’ in program
/media/data/rockbox/devenvironment/apps/plugins/sncviewer.c:191: error: expected identifier or ‘(’ before ‘+’ token
/media/data/rockbox/devenvironment/apps/plugins/sncviewer.c:191: error: stray ‘#’ in program
/media/data/rockbox/devenvironment/apps/plugins/sncviewer.c:193: error: stray ‘#’ in program
/media/data/rockbox/devenvironment/apps/plugins/sncviewer.c:195: error: stray ‘#’ in program
/media/data/rockbox/devenvironment/apps/plugins/sncviewer.c:196: error: stray ‘#’ in program
/media/data/rockbox/devenvironment/apps/plugins/sncviewer.c:197: error: stray ‘#’ in program
/media/data/rockbox/devenvironment/apps/plugins/sncviewer.c:198: error: stray ‘#’ in program
/media/data/rockbox/devenvironment/apps/plugins/sncviewer.c:199: error: expected ‘=’, ‘,’, ‘;’, ‘asm’ or ‘__attribute__’ before ‘->’ token
/media/data/rockbox/devenvironment/apps/plugins/sncviewer.c:199: error: expected ‘=’, ‘,’, ‘;’, ‘asm’ or ‘__attribute__’ before ‘->’ token
/media/data/rockbox/devenvironment/apps/plugins/sncviewer.c:199: error: expected ‘=’, ‘,’, ‘;’, ‘asm’ or ‘__attribute__’ before ‘->’ token
/media/data/rockbox/devenvironment/apps/plugins/sncviewer.c:200: error: expected identifier or ‘(’ before ‘+’ token
/media/data/rockbox/devenvironment/apps/plugins/sncviewer.c:200: error: stray ‘#’ in program
/media/data/rockbox/devenvironment/apps/plugins/sncviewer.c:201: error: stray ‘#’ in program
/media/data/rockbox/devenvironment/apps/plugins/sncviewer.c:202: error: stray ‘#’ in program
/media/data/rockbox/devenvironment/apps/plugins/sncviewer.c:218: warning: data definition has no type or storage class
/media/data/rockbox/devenvironment/apps/plugins/sncviewer.c:218: warning: type defaults to ‘int’ in declaration of ‘prefs’
/media/data/rockbox/devenvironment/apps/plugins/sncviewer.c:219: error: expected identifier or ‘(’ before ‘+’ token
/media/data/rockbox/devenvironment/apps/plugins/sncviewer.c:223: warning: data definition has no type or storage class
/media/data/rockbox/devenvironment/apps/plugins/sncviewer.c:223: warning: type defaults to ‘int’ in declaration of ‘g_art’
/media/data/rockbox/devenvironment/apps/plugins/sncviewer.c:223: warning: type defaults to ‘int’ in declaration of ‘g_tit’
/media/data/rockbox/devenvironment/apps/plugins/sncviewer.c:223: warning: type defaults to ‘int’ in declaration of ‘g_next_at’
/media/data/rockbox/devenvironment/apps/plugins/sncviewer.c:224: error: expected identifier or ‘(’ before ‘+’ token
/media/data/rockbox/devenvironment/apps/plugins/sncviewer.c:228: error: ‘MAX_SECTIONS’ undeclared here (not in a function)
/media/data/rockbox/devenvironment/apps/plugins/sncviewer.c:228: warning: data definition has no type or storage class
/media/data/rockbox/devenvironment/apps/plugins/sncviewer.c:228: warning: type defaults to ‘int’ in declaration of ‘sncs’
/media/data/rockbox/devenvironment/apps/plugins/sncviewer.c:229: error: expected identifier or ‘(’ before ‘+’ token
/media/data/rockbox/devenvironment/apps/plugins/sncviewer.c:236: error: expected identifier or ‘(’ before ‘+’ token
/media/data/rockbox/devenvironment/apps/plugins/sncviewer.c:241: warning: data definition has no type or storage class
/media/data/rockbox/devenvironment/apps/plugins/sncviewer.c:241: warning: type defaults to ‘int’ in declaration of ‘delete_list’
/media/data/rockbox/devenvironment/apps/plugins/sncviewer.c:242: error: expected identifier or ‘(’ before ‘+’ token
/media/data/rockbox/devenvironment/apps/plugins/sncviewer.c:244: error: expected identifier or ‘(’ before ‘+’ token
/media/data/rockbox/devenvironment/apps/plugins/sncviewer.c:245: error: expected identifier or ‘(’ before ‘+’ token
/media/data/rockbox/devenvironment/apps/plugins/sncviewer.c:246: error: expected identifier or ‘(’ before ‘+’ token
/media/data/rockbox/devenvironment/apps/plugins/sncviewer.c:247: error: expected identifier or ‘(’ before ‘+’ token
/media/data/rockbox/devenvironment/apps/plugins/sncviewer.c:248: error: expected identifier or ‘(’ before ‘+’ token
/media/data/rockbox/devenvironment/apps/plugins/sncviewer.c:249: error: expected identifier or ‘(’ before ‘+’ token
/media/data/rockbox/devenvironment/apps/plugins/sncviewer.c:250: error: expected identifier or ‘(’ before ‘+’ token
/media/data/rockbox/devenvironment/apps/plugins/sncviewer.c:251: error: expected identifier or ‘(’ before ‘+’ token
/media/data/rockbox/devenvironment/apps/plugins/sncviewer.c:252: error: expected identifier or ‘(’ before ‘+’ token
/media/data/rockbox/devenvironment/apps/plugins/sncviewer.c:253: error: expected identifier or ‘(’ before ‘+’ token
/media/data/rockbox/devenvironment/apps/plugins/sncviewer.c:254: error: expected identifier or ‘(’ before ‘+’ token
/media/data/rockbox/devenvironment/apps/plugins/sncviewer.c:256: error: expected identifier or ‘(’ before ‘+’ token
/media/data/rockbox/devenvironment/apps/plugins/sncviewer.c:257: error: expected identifier or ‘(’ before ‘+’ token
/media/data/rockbox/devenvironment/apps/plugins/sncviewer.c:258: error: expected identifier or ‘(’ before ‘+’ token
/media/data/rockbox/devenvironment/apps/plugins/sncviewer.c:259: error: expected identifier or ‘(’ before ‘+’ token
/media/data/rockbox/devenvironment/apps/plugins/sncviewer.c:260: error: expected identifier or ‘(’ before ‘+’ token
/media/data/rockbox/devenvironment/apps/plugins/sncviewer.c:261: error: expected identifier or ‘(’ before ‘+’ token
/media/data/rockbox/devenvironment/apps/plugins/sncviewer.c:262: error: expected identifier or ‘(’ before ‘+’ token
/media/data/rockbox/devenvironment/apps/plugins/sncviewer.c:263: error: expected identifier or ‘(’ before ‘+’ token
/media/data/rockbox/devenvironment/apps/plugins/sncviewer.c:265: error: expected identifier or ‘(’ before ‘+’ token
/media/data/rockbox/devenvironment/apps/plugins/sncviewer.c:267: error: expected identifier or ‘(’ before ‘+’ token
/media/data/rockbox/devenvironment/apps/plugins/sncviewer.c:268: error: expected identifier or ‘(’ before ‘+’ token
/media/data/rockbox/devenvironment/apps/plugins/sncviewer.c:270: error: expected identifier or ‘(’ before ‘+’ token
/media/data/rockbox/devenvironment/apps/plugins/sncviewer.c:271: error: expected identifier or ‘(’ before ‘+’ token
/media/data/rockbox/devenvironment/apps/plugins/sncviewer.c:272: error: expected identifier or ‘(’ before ‘+’ token
/media/data/rockbox/devenvironment/apps/plugins/sncviewer.c:273: error: expected identifier or ‘(’ before ‘+’ token
/media/data/rockbox/devenvironment/apps/plugins/sncviewer.c:274: error: expected identifier or ‘(’ before ‘+’ token
/media/data/rockbox/devenvironment/apps/plugins/sncviewer.c:275: error: expected identifier or ‘(’ before ‘+’ token
/media/data/rockbox/devenvironment/apps/plugins/sncviewer.c:276: error: expected identifier or ‘(’ before ‘+’ token
/media/data/rockbox/devenvironment/apps/plugins/sncviewer.c:278: error: expected identifier or ‘(’ before ‘+’ token
/media/data/rockbox/devenvironment/apps/plugins/sncviewer.c:280: error: expected identifier or ‘(’ before ‘+’ token
/media/data/rockbox/devenvironment/apps/plugins/sncviewer.c:281: error: expected identifier or ‘(’ before ‘+’ token
/media/data/rockbox/devenvironment/apps/plugins/sncviewer.c:282: error: expected identifier or ‘(’ before ‘+’ token
/media/data/rockbox/devenvironment/apps/plugins/sncviewer.c:283: error: expected identifier or ‘(’ before ‘+’ token
/media/data/rockbox/devenvironment/apps/plugins/sncviewer.c:284: error: expected identifier or ‘(’ before ‘+’ token
/media/data/rockbox/devenvironment/apps/plugins/sncviewer.c:285: error: expected identifier or ‘(’ before ‘+’ token
/media/data/rockbox/devenvironment/apps/plugins/sncviewer.c:286: error: expected identifier or ‘(’ before ‘+’ token
/media/data/rockbox/devenvironment/apps/plugins/sncviewer.c:287: error: expected identifier or ‘(’ before ‘+’ token
/media/data/rockbox/devenvironment/apps/plugins/sncviewer.c:290: error: stray ‘#’ in program
/media/data/rockbox/devenvironment/apps/plugins/sncviewer.c:293: error: stray ‘#’ in program
/media/data/rockbox/devenvironment/apps/plugins/sncviewer.c:295: error: expected identifier or ‘(’ before ‘+’ token
/media/data/rockbox/devenvironment/apps/plugins/sncviewer.c:298: error: stray ‘#’ in program
/media/data/rockbox/devenvironment/apps/plugins/sncviewer.c:300: error: stray ‘#’ in program
/media/data/rockbox/devenvironment/apps/plugins/sncviewer.c:302: error: expected identifier or ‘(’ before ‘+’ token
/media/data/rockbox/devenvironment/apps/plugins/sncviewer.c:305: error: stray ‘#’ in program
/media/data/rockbox/devenvironment/apps/plugins/sncviewer.c:308: error: stray ‘#’ in program
/media/data/rockbox/devenvironment/apps/plugins/sncviewer.c:310: error: stray ‘#’ in program
/media/data/rockbox/devenvironment/apps/plugins/sncviewer.c:313: error: stray ‘#’ in program
/media/data/rockbox/devenvironment/apps/plugins/sncviewer.c:316: error: expected identifier or ‘(’ before ‘+’ token
/media/data/rockbox/devenvironment/apps/plugins/sncviewer.c:317: error: stray ‘#’ in program
/media/data/rockbox/devenvironment/apps/plugins/sncviewer.c:326: error: expected identifier or ‘(’ before ‘+’ token
/media/data/rockbox/devenvironment/apps/plugins/sncviewer.c:326: error: stray ‘#’ in program
/media/data/rockbox/devenvironment/apps/plugins/sncviewer.c:330: error: expected identifier or ‘(’ before ‘+’ token
/media/data/rockbox/devenvironment/apps/plugins/sncviewer.c:336: error: expected identifier or ‘(’ before ‘+’ token
/media/data/rockbox/devenvironment/apps/plugins/sncviewer.c:342: error: expected identifier or ‘(’ before ‘+’ token
/media/data/rockbox/devenvironment/apps/plugins/sncviewer.c:347: error: expected identifier or ‘(’ before ‘+’ token
/media/data/rockbox/devenvironment/apps/plugins/sncviewer.c:354: error: expected identifier or ‘(’ before ‘+’ token
/media/data/rockbox/devenvironment/apps/plugins/sncviewer.c:369: error: expected identifier or ‘(’ before ‘+’ token
/media/data/rockbox/devenvironment/apps/plugins/sncviewer.c:371: error: stray ‘#’ in program
/media/data/rockbox/devenvironment/apps/plugins/sncviewer.c:414: error: expected identifier or ‘(’ before ‘+’ token
/media/data/rockbox/devenvironment/apps/plugins/sncviewer.c:431: error: expected identifier or ‘(’ before ‘+’ token
/media/data/rockbox/devenvironment/apps/plugins/sncviewer.c:447: error: expected identifier or ‘(’ before ‘+’ token
/media/data/rockbox/devenvironment/apps/plugins/sncviewer.c:461: error: expected identifier or ‘(’ before ‘+’ token
/media/data/rockbox/devenvironment/apps/plugins/sncviewer.c:469: error: expected identifier or ‘(’ before ‘+’ token
/media/data/rockbox/devenvironment/apps/plugins/sncviewer.c:495: error: expected identifier or ‘(’ before ‘+’ token
/media/data/rockbox/devenvironment/apps/plugins/sncviewer.c:509: error: expected identifier or ‘(’ before ‘+’ token
/media/data/rockbox/devenvironment/apps/plugins/sncviewer.c:544: error: stray ‘#’ in program
/media/data/rockbox/devenvironment/apps/plugins/sncviewer.c:548: error: stray ‘#’ in program
/media/data/rockbox/devenvironment/apps/plugins/sncviewer.c:560: error: expected identifier or ‘(’ before ‘+’ token
/media/data/rockbox/devenvironment/apps/plugins/sncviewer.c:575: error: expected identifier or ‘(’ before ‘+’ token
/media/data/rockbox/devenvironment/apps/plugins/sncviewer.c:648: error: expected identifier or ‘(’ before ‘+’ token
/media/data/rockbox/devenvironment/apps/plugins/sncviewer.c:658: error: expected identifier or ‘(’ before ‘+’ token
/media/data/rockbox/devenvironment/apps/plugins/sncviewer.c:673: error: expected identifier or ‘(’ before ‘+’ token
/media/data/rockbox/devenvironment/apps/plugins/sncviewer.c:712: error: expected identifier or ‘(’ before ‘+’ token
/media/data/rockbox/devenvironment/apps/plugins/sncviewer.c:714: error: stray ‘#’ in program
/media/data/rockbox/devenvironment/apps/plugins/sncviewer.c:780: error: expected identifier or ‘(’ before ‘+’ token
/media/data/rockbox/devenvironment/apps/plugins/sncviewer.c:799: error: expected identifier or ‘(’ before ‘+’ token
/media/data/rockbox/devenvironment/apps/plugins/sncviewer.c:809: error: stray ‘#’ in program
/media/data/rockbox/devenvironment/apps/plugins/sncviewer.c:814: error: stray ‘#’ in program
/media/data/rockbox/devenvironment/apps/plugins/sncviewer.c:817: error: expected identifier or ‘(’ before ‘+’ token
/media/data/rockbox/devenvironment/apps/plugins/sncviewer.c:824: error: stray ‘#’ in program
/media/data/rockbox/devenvironment/apps/plugins/sncviewer.c:869: error: stray ‘#’ in program
/media/data/rockbox/devenvironment/apps/plugins/sncviewer.c:871: error: stray ‘#’ in program
/media/data/rockbox/devenvironment/apps/plugins/sncviewer.c:873: error: stray ‘#’ in program
/media/data/rockbox/devenvironment/apps/plugins/sncviewer.c:880: error: expected identifier or ‘(’ before ‘+’ token
/media/data/rockbox/devenvironment/apps/plugins/sncviewer.c:889: error: stray ‘#’ in program
/media/data/rockbox/devenvironment/apps/plugins/sncviewer.c:892: error: stray ‘#’ in program
/media/data/rockbox/devenvironment/apps/plugins/sncviewer.c:894: error: stray ‘#’ in program
/media/data/rockbox/devenvironment/apps/plugins/sncviewer.c:932: error: expected identifier or ‘(’ before ‘+’ token
/media/data/rockbox/devenvironment/apps/plugins/sncviewer.c:1005: error: stray ‘#’ in program
/media/data/rockbox/devenvironment/apps/plugins/sncviewer.c:1014: error: stray ‘#’ in program
/media/data/rockbox/devenvironment/apps/plugins/sncviewer.c:1017: error: expected identifier or ‘(’ before ‘+’ token
/media/data/rockbox/devenvironment/apps/plugins/sncviewer.c:1032: error: stray ‘#’ in program
/media/data/rockbox/devenvironment/apps/plugins/sncviewer.c:1036: error: stray ‘#’ in program
/media/data/rockbox/devenvironment/apps/plugins/sncviewer.c:1044: error: expected identifier or ‘(’ before ‘+’ token
/media/data/rockbox/devenvironment/apps/plugins/sncviewer.c:1079: error: expected identifier or ‘(’ before ‘+’ token
/media/data/rockbox/devenvironment/apps/plugins/sncviewer.c:1120: error: expected identifier or ‘(’ before ‘+’ token
/media/data/rockbox/devenvironment/apps/plugins/sncviewer.c:1127: error: expected identifier or ‘(’ before ‘+’ token
/media/data/rockbox/devenvironment/apps/plugins/sncviewer.c:1137: error: expected identifier or ‘(’ before ‘+’ token
/media/data/rockbox/devenvironment/apps/plugins/sncviewer.c:1156: error: expected identifier or ‘(’ before ‘+’ token
/media/data/rockbox/devenvironment/apps/plugins/sncviewer.c:1190: error: expected identifier or ‘(’ before ‘+’ token
/media/data/rockbox/devenvironment/apps/plugins/sncviewer.c:1244: error: expected identifier or ‘(’ before ‘+’ token
/media/data/rockbox/devenvironment/apps/plugins/sncviewer.c:1256: error: stray ‘#’ in program
/media/data/rockbox/devenvironment/apps/plugins/sncviewer.c:1272: error: expected identifier or ‘(’ before ‘+’ token
/media/data/rockbox/devenvironment/apps/plugins/sncviewer.c:1287: error: expected identifier or ‘(’ before ‘+’ token
/media/data/rockbox/devenvironment/apps/plugins/sncviewer.c:1304: error: expected identifier or ‘(’ before ‘+’ token
/media/data/rockbox/devenvironment/apps/plugins/sncviewer.c:1308: error: expected identifier or ‘(’ before ‘+’ token
/media/data/rockbox/devenvironment/apps/plugins/sncviewer.c:1327: error: expected identifier or ‘(’ before ‘+’ token
/media/data/rockbox/devenvironment/apps/plugins/sncviewer.c:1375: error: expected identifier or ‘(’ before ‘+’ token
/media/data/rockbox/devenvironment/apps/plugins/sncviewer.c:1388: error: stray ‘#’ in program
/media/data/rockbox/devenvironment/apps/plugins/sncviewer.c:1390: error: stray ‘#’ in program
/media/data/rockbox/devenvironment/apps/plugins/sncviewer.c:1393: error: expected identifier or ‘(’ before ‘+’ token
/media/data/rockbox/devenvironment/apps/plugins/sncviewer.c:1404: error: expected identifier or ‘(’ before ‘+’ token
/media/data/rockbox/devenvironment/apps/plugins/sncviewer.c:1405: error: stray ‘#’ in program
/media/data/rockbox/devenvironment/apps/plugins/sncviewer.c:1434: error: expected identifier or ‘(’ before ‘+’ token
/media/data/rockbox/devenvironment/apps/plugins/sncviewer.c:1446: error: stray ‘#’ in program
/media/data/rockbox/devenvironment/apps/plugins/sncviewer.c:1448: error: stray ‘#’ in program
/media/data/rockbox/devenvironment/apps/plugins/sncviewer.c:1454: error: expected identifier or ‘(’ before ‘+’ token
/media/data/rockbox/devenvironment/apps/plugins/sncviewer.c:1473: error: expected identifier or ‘(’ before ‘+’ token
/media/data/rockbox/devenvironment/apps/plugins/sncviewer.c:1573: error: expected identifier or ‘(’ before ‘+’ token
/media/data/rockbox/devenvironment/apps/plugins/sncviewer.c:1573: error: stray ‘#’ in program
/media/data/rockbox/devenvironment/apps/plugins/sncviewer.c:1656: error: expected identifier or ‘(’ before ‘+’ token
/media/data/rockbox/devenvironment/apps/plugins/sncviewer.c:1708: error: expected identifier or ‘(’ before ‘+’ token
/media/data/rockbox/devenvironment/apps/plugins/sncviewer.c:1729: error: expected identifier or ‘(’ before ‘+’ token
/media/data/rockbox/devenvironment/apps/plugins/sncviewer.c:1753: error: stray ‘#’ in program
/media/data/rockbox/devenvironment/apps/plugins/sncviewer.c:1756: error: stray ‘#’ in program
/media/data/rockbox/devenvironment/apps/plugins/sncviewer.c:1784: error: expected identifier or ‘(’ before ‘+’ token
/media/data/rockbox/devenvironment/apps/plugins/sncviewer.c:1804: error: expected identifier or ‘(’ before ‘+’ token
/media/data/rockbox/devenvironment/apps/plugins/sncviewer.c:1809: error: expected identifier or ‘(’ before ‘+’ token
/media/data/rockbox/devenvironment/apps/plugins/sncviewer.c:1831: error: expected identifier or ‘(’ before ‘+’ token
/media/data/rockbox/devenvironment/apps/plugins/sncviewer.c:1871: error: expected identifier or ‘(’ before ‘+’ token
/media/data/rockbox/devenvironment/apps/plugins/sncviewer.c:1921: error: stray ‘#’ in program
/media/data/rockbox/devenvironment/apps/plugins/sncviewer.c:1923: error: stray ‘#’ in program
/media/data/rockbox/devenvironment/apps/plugins/sncviewer.c:1925: error: stray ‘#’ in program
/media/data/rockbox/devenvironment/apps/plugins/sncviewer.c:1928: error: stray ‘#’ in program
/media/data/rockbox/devenvironment/apps/plugins/sncviewer.c:1953: error: stray ‘#’ in program
/media/data/rockbox/devenvironment/apps/plugins/sncviewer.c:1955: error: stray ‘#’ in program
/media/data/rockbox/devenvironment/apps/plugins/sncviewer.c:1957: error: expected identifier or ‘(’ before ‘+’ token
/media/data/rockbox/devenvironment/apps/plugins/sncviewer.c:1976: error: expected identifier or ‘(’ before ‘+’ token
/media/data/rockbox/devenvironment/apps/plugins/sncviewer.c:2084: error: expected identifier or ‘(’ before ‘+’ token
/media/data/rockbox/devenvironment/apps/plugins/sncviewer.c:2095: error: expected identifier or ‘(’ before ‘+’ token
/media/data/rockbox/devenvironment/apps/plugins/sncviewer.c:2102: error: expected identifier or ‘(’ before ‘+’ token
/media/data/rockbox/devenvironment/apps/plugins/sncviewer.c:2124: error: expected identifier or ‘(’ before ‘+’ token
/media/data/rockbox/devenvironment/apps/plugins/sncviewer.c:2147: error: expected identifier or ‘(’ before ‘+’ token
/media/data/rockbox/devenvironment/apps/plugins/sncviewer.c:2149: error: stray ‘#’ in program
/media/data/rockbox/devenvironment/apps/plugins/sncviewer.c:2194: error: expected identifier or ‘(’ before ‘+’ token
/media/data/rockbox/devenvironment/apps/plugins/sncviewer.c:2198: error: expected identifier or ‘(’ before ‘+’ token
/media/data/rockbox/devenvironment/apps/plugins/sncviewer.c:2258: error: expected identifier or ‘(’ before ‘+’ token
/media/data/rockbox/devenvironment/apps/plugins/sncviewer.c:2285: error: expected identifier or ‘(’ before ‘+’ token
/media/data/rockbox/devenvironment/apps/plugins/sncviewer.c:2305: error: expected identifier or ‘(’ before ‘+’ token
/media/data/rockbox/devenvironment/apps/plugins/sncviewer.c:2342: error: expected identifier or ‘(’ before ‘+’ token
/media/data/rockbox/devenvironment/apps/plugins/sncviewer.c:2367: error: expected identifier or ‘(’ before ‘+’ token
/media/data/rockbox/devenvironment/apps/plugins/sncviewer.c:2382: error: expected identifier or ‘(’ before ‘+’ token
/media/data/rockbox/devenvironment/apps/plugins/sncviewer.c:2425: error: expected identifier or ‘(’ before ‘+’ token
/media/data/rockbox/devenvironment/apps/plugins/sncviewer.c:2452: error: expected identifier or ‘(’ before ‘+’ token
/media/data/rockbox/devenvironment/apps/plugins/sncviewer.c:2465: error: expected identifier or ‘(’ before ‘+’ token
/media/data/rockbox/devenvironment/apps/plugins/sncviewer.c:2467: error: stray ‘#’ in program
/media/data/rockbox/devenvironment/apps/plugins/sncviewer.c:2468: error: stray ‘#’ in program
/media/data/rockbox/devenvironment/apps/plugins/sncviewer.c:2469: error: stray ‘#’ in program
/media/data/rockbox/devenvironment/apps/plugins/sncviewer.c:2470: error: stray ‘#’ in program
/media/data/rockbox/devenvironment/apps/plugins/sncviewer.c:2471: error: stray ‘#’ in program
/media/data/rockbox/devenvironment/apps/plugins/sncviewer.c:2472: error: stray ‘#’ in program
/media/data/rockbox/devenvironment/apps/plugins/sncviewer.c:2473: error: stray ‘#’ in program
/media/data/rockbox/devenvironment/apps/plugins/sncviewer.c:2478: error: expected identifier or ‘(’ before ‘+’ token
/media/data/rockbox/devenvironment/apps/plugins/sncviewer.c:2502: error: expected identifier or ‘(’ before ‘+’ token
/media/data/rockbox/devenvironment/apps/plugins/sncviewer.c:2551: error: expected identifier or ‘(’ before ‘+’ token
/media/data/rockbox/devenvironment/apps/plugins/sncviewer.c:2572: error: expected identifier or ‘(’ before ‘+’ token
/media/data/rockbox/devenvironment/apps/plugins/sncviewer.c:2620: error: expected identifier or ‘(’ before ‘+’ token
/media/data/rockbox/devenvironment/apps/plugins/sncviewer.c:2634: error: stray ‘#’ in program
/media/data/rockbox/devenvironment/apps/plugins/sncviewer.c:2776: error: expected identifier or ‘(’ before ‘+’ token
/media/data/rockbox/devenvironment/apps/plugins/sncviewer.c:2777: error: stray ‘#’ in program
/media/data/rockbox/devenvironment/apps/plugins/sncviewer.c:2789: error: expected identifier or ‘(’ before ‘+’ token
/media/data/rockbox/devenvironment/apps/plugins/sncviewer.c:2794: error: expected identifier or ‘(’ before ‘+’ token
/media/data/rockbox/devenvironment/apps/plugins/sncviewer.c:2802: error: expected identifier or ‘(’ before ‘+’ token
/media/data/rockbox/devenvironment/apps/plugins/sncviewer.c:2807: error: expected identifier or ‘(’ before ‘+’ token
/media/data/rockbox/devenvironment/apps/plugins/sncviewer.c:2807: error: stray ‘#’ in program
/media/data/rockbox/devenvironment/apps/plugins/sncviewer.c:2824: error: expected identifier or ‘(’ before ‘+’ token
/media/data/rockbox/devenvironment/apps/plugins/sncviewer.c:2848: error: expected identifier or ‘(’ before ‘+’ token
/media/data/rockbox/devenvironment/apps/plugins/sncviewer.c:2881: error: expected identifier or ‘(’ before ‘+’ token
/media/data/rockbox/devenvironment/apps/plugins/sncviewer.c:2928: error: expected identifier or ‘(’ before ‘+’ token
/media/data/rockbox/devenvironment/apps/plugins/sncviewer.c:2935: error: expected identifier or ‘(’ before ‘+’ token
/media/data/rockbox/devenvironment/apps/plugins/sncviewer.c:2936: error: stray ‘#’ in program
/media/data/rockbox/devenvironment/apps/plugins/sncviewer.c:2944: error: expected identifier or ‘(’ before ‘+’ token
/media/data/rockbox/devenvironment/apps/plugins/sncviewer.c:2944: error: stray ‘#’ in program
/media/data/rockbox/devenvironment/apps/plugins/sncviewer.c:2964: error: expected identifier or ‘(’ before ‘+’ token
/media/data/rockbox/devenvironment/apps/plugins/sncviewer.c:2983: error: expected identifier or ‘(’ before ‘+’ token
/media/data/rockbox/devenvironment/apps/plugins/sncviewer.c:2985: error: stray ‘#’ in program
/media/data/rockbox/devenvironment/apps/plugins/sncviewer.c:2986: error: stray ‘#’ in program
/media/data/rockbox/devenvironment/apps/plugins/sncviewer.c:3010: error: expected identifier or ‘(’ before ‘+’ token
/media/data/rockbox/devenvironment/apps/plugins/sncviewer.c:3016: error: expected identifier or ‘(’ before ‘+’ token
/media/data/rockbox/devenvironment/apps/plugins/sncviewer.c:3039: error: expected identifier or ‘(’ before ‘+’ token
/media/data/rockbox/devenvironment/apps/plugins/sncviewer.c:3048: error: expected identifier or ‘(’ before ‘+’ token
/media/data/rockbox/devenvironment/apps/plugins/sncviewer.c:3049: error: stray ‘#’ in program
/media/data/rockbox/devenvironment/apps/plugins/sncviewer.c:3055: error: expected identifier or ‘(’ before ‘+’ token
/media/data/rockbox/devenvironment/apps/plugins/sncviewer.c:3056: error: expected identifier or ‘(’ before ‘+’ token
/media/data/rockbox/devenvironment/apps/plugins/sncviewer.c:3057: error: expected identifier or ‘(’ before ‘+’ token
/media/data/rockbox/devenvironment/apps/plugins/sncviewer.c:3058: error: expected identifier or ‘(’ before ‘+’ token
/media/data/rockbox/devenvironment/apps/plugins/sncviewer.c:3059: error: expected identifier or ‘(’ before ‘+’ token
/media/data/rockbox/devenvironment/apps/plugins/sncviewer.c:3060: error: expected identifier or ‘(’ before ‘+’ token
/media/data/rockbox/devenvironment/apps/plugins/sncviewer.c:3063: error: expected identifier or ‘(’ before ‘+’ token
/media/data/rockbox/devenvironment/apps/plugins/sncviewer.c:3064: error: expected identifier or ‘(’ before ‘+’ token
/media/data/rockbox/devenvironment/apps/plugins/sncviewer.c:3065: error: expected identifier or ‘(’ before ‘+’ token
/media/data/rockbox/devenvironment/apps/plugins/sncviewer.c:3066: error: expected identifier or ‘(’ before ‘+’ token
/media/data/rockbox/devenvironment/apps/plugins/sncviewer.c:3067: error: expected identifier or ‘(’ before ‘+’ token
/media/data/rockbox/devenvironment/apps/plugins/sncviewer.c:3068: error: expected identifier or ‘(’ before ‘+’ token
/media/data/rockbox/devenvironment/apps/plugins/sncviewer.c:3069: error: expected identifier or ‘(’ before ‘+’ token
/media/data/rockbox/devenvironment/apps/plugins/sncviewer.c:3070: error: expected identifier or ‘(’ before ‘+’ token
/media/data/rockbox/devenvironment/apps/plugins/sncviewer.c:3071: error: expected identifier or ‘(’ before ‘+’ token
/media/data/rockbox/devenvironment/apps/plugins/sncviewer.c:3074: error: expected identifier or ‘(’ before ‘+’ token
/media/data/rockbox/devenvironment/apps/plugins/sncviewer.c:3075: error: expected identifier or ‘(’ before ‘+’ token
/media/data/rockbox/devenvironment/apps/plugins/sncviewer.c:3076: error: expected identifier or ‘(’ before ‘+’ token
/media/data/rockbox/devenvironment/apps/plugins/sncviewer.c:3076: error: stray ‘#’ in program
/media/data/rockbox/devenvironment/apps/plugins/sncviewer.c:3078: error: expected identifier or ‘(’ before ‘+’ token
/media/data/rockbox/devenvironment/apps/plugins/sncviewer.c:3078: error: stray ‘#’ in program
/media/data/rockbox/devenvironment/apps/plugins/sncviewer.c:3079: error: stray ‘#’ in program
/media/data/rockbox/devenvironment/apps/plugins/sncviewer.c:3080: error: stray ‘#’ in program
/media/data/rockbox/devenvironment/apps/plugins/sncviewer.c:3081: error: stray ‘#’ in program
/media/data/rockbox/devenvironment/apps/plugins/sncviewer.c:3083: error: stray ‘#’ in program
/media/data/rockbox/devenvironment/apps/plugins/sncviewer.c:3088: error: stray ‘#’ in program
/media/data/rockbox/devenvironment/apps/plugins/sncviewer.c:3091: error: stray ‘#’ in program
/media/data/rockbox/devenvironment/apps/plugins/sncviewer.c:3094: error: stray ‘#’ in program
/media/data/rockbox/devenvironment/apps/plugins/sncviewer.c:3096: error: expected identifier or ‘(’ before ‘+’ token
/media/data/rockbox/devenvironment/apps/plugins/sncviewer.c:3097: error: expected identifier or ‘(’ before ‘+’ token
/media/data/rockbox/devenvironment/apps/plugins/sncviewer.c:3098: error: expected identifier or ‘(’ before ‘+’ token
/media/data/rockbox/devenvironment/apps/plugins/sncviewer.c:3099: error: stray ‘#’ in program
/media/data/rockbox/devenvironment/apps/plugins/sncviewer.c:3101: error: stray ‘#’ in program
/media/data/rockbox/devenvironment/apps/plugins/sncviewer.c:3102: error: stray ‘#’ in program
/media/data/rockbox/devenvironment/apps/plugins/sncviewer.c:3103: error: stray ‘#’ in program
/media/data/rockbox/devenvironment/apps/plugins/sncviewer.c:3109: error: expected identifier or ‘(’ before ‘+’ token
/media/data/rockbox/devenvironment/apps/plugins/sncviewer.c:3113: error: expected identifier or ‘(’ before ‘+’ token
/media/data/rockbox/devenvironment/apps/plugins/sncviewer.c:3123: error: expected identifier or ‘(’ before ‘+’ token
/media/data/rockbox/devenvironment/apps/plugins/sncviewer.c:3145: error: expected identifier or ‘(’ before ‘+’ token
/media/data/rockbox/devenvironment/apps/plugins/sncviewer.c:3172: error: stray ‘#’ in program
/media/data/rockbox/devenvironment/apps/plugins/sncviewer.c:3174: error: stray ‘#’ in program
/media/data/rockbox/devenvironment/apps/plugins/sncviewer.c:3196: error: expected identifier or ‘(’ before ‘+’ token
/media/data/rockbox/devenvironment/apps/plugins/sncviewer.c:3217: error: expected identifier or ‘(’ before ‘+’ token
/media/data/rockbox/devenvironment/apps/plugins/sncviewer.c:3251: error: expected identifier or ‘(’ before ‘+’ token
/media/data/rockbox/devenvironment/apps/plugins/sncviewer.c:3262: error: stray ‘#’ in program
/media/data/rockbox/devenvironment/apps/plugins/sncviewer.c:3269: error: stray ‘#’ in program
/media/data/rockbox/devenvironment/apps/plugins/sncviewer.c:3270: error: stray ‘#’ in program
/media/data/rockbox/devenvironment/apps/plugins/sncviewer.c:3283: error: stray ‘#’ in program
/media/data/rockbox/devenvironment/apps/plugins/sncviewer.c:3288: error: stray ‘#’ in program
/media/data/rockbox/devenvironment/apps/plugins/sncviewer.c:3295: error: stray ‘#’ in program
/media/data/rockbox/devenvironment/apps/plugins/sncviewer.c:3300: error: stray ‘#’ in program
/media/data/rockbox/devenvironment/apps/plugins/sncviewer.c:3366: error: stray ‘#’ in program
/media/data/rockbox/devenvironment/apps/plugins/sncviewer.c:3372: error: stray ‘#’ in program
/media/data/rockbox/devenvironment/apps/plugins/sncviewer.c:3373: error: stray ‘#’ in program
/media/data/rockbox/devenvironment/apps/plugins/sncviewer.c:3376: error: stray ‘#’ in program
/media/data/rockbox/devenvironment/apps/plugins/sncviewer.c:3381: error: expected ‘=’, ‘,’, ‘;’, ‘asm’ or ‘__attribute__’ before ‘:’ token
/media/data/rockbox/devenvironment/apps/plugins/sncviewer.c:3385: error: stray ‘@’ in program
/media/data/rockbox/devenvironment/apps/plugins/sncviewer.c:3385: error: stray ‘@’ in program
/media/data/rockbox/devenvironment/apps/plugins/sncviewer.c:3385: error: stray ‘@’ in program
/media/data/rockbox/devenvironment/apps/plugins/sncviewer.c:3385: error: stray ‘@’ in program
make: *** [/media/data/rockbox/devenvironment/build-dir/apps/plugins/sncviewer.o] Error 1