1
2
3
4
5
6
7
8
9
Traceback (most recent call last):
  File "/home/path/coding/gr-air-modes/build/python_compile_helper.py", line 6, in <module>
    py_compile.compile(file=src, cfile=gen, doraise=True)
  File "/usr/lib/python2.6/py_compile.py", line 129, in compile
    raise py_exc
py_compile.PyCompileError: Sorry: IndentationError: ('unexpected indent', ('/home/path/coding/gr-air-modes/python/modes_kml.py', 157, 12, '            retstr+= "\\n\\t\\t<Placemark>\\n\\t\\t\\t<styleUrl>#track</styleUrl>\\n\\t\\t\\t<LineString>\\n\\t\\t\\t\\t<extrude>0</extrude>\\n\\t\\t\\t\\t<altitudeMode>absolute</altitudeMode>\\n\\t\\t\\t\\t<coordinates>%s</coordinates>\\n\\t\\t\\t</LineString>\\n\\t\\t</Placemark>" % (trackstr,)\n'))
make[2]: *** [python/__init__.pyc] Fehler 1
make[1]: *** [python/CMakeFiles/pygen_python_6f35b.dir/all] Fehler 2
make: *** [all] Fehler 2