1
2
3
4
5
6
7
8
9
10
11
12
13
14
15
16
17
18
19
20
21
22
23
24
25
26
27
28
29
30
31
32
33
34
35
36
37
38
39
40
41
42
43
44
45
46
47
48
49
50
51
52
53
54
55
56
57
58
59
60
61
62
63
64
65
66
67
68
69
70
71
72
73
74
75
76
77
78
79
80
81
82
83
84
85
86
87
88
89
90
91
92
93
94
95
96
97
98
99
100
101
102
103
104
105
106
107
108
109
110
111
112
113
114
115
116
117
118
119
120
121
122
123
124
125
126
127
128
129
130
131
132
133
134
135
136
137
138
139
140
141
142
143
144
145
146
147
148
149
150
151
152
153
154
155
156
157
158
159
160
161
162
163
164
165
166
167
168
169
170
171
172
173
174
175
176
177
178
179
180
181
182
183
184
185
186
187
188
189
190
191
192
193
194
195
196
197
198
199
200
201
202
203
204
205
206
207
208
209
210
211
212
213
214
215
216
217
218
219
220
221
222
223
224
225
226
227
228
229
230
231
232
233
234
235
236
237
238
239
240
241
242
243
244
245
246
247
248
249
250
251
252
253
254
255
256
257
258
259
260
261
262
263
264
265
266
267
268
269
270
271
272
273
274
275
276
277
278
279
280
281
282
283
284
285
286
287
288
289
290
291
292
293
294
295
296
297
298
299
300
301
302
303
304
305
306
307
308
309
310
311
312
313
314
315
316
==> Starting build()...
-- The C compiler identification is GNU 4.7.1
-- The CXX compiler identification is GNU 4.7.1
-- Check for working C compiler: /usr/bin/gcc
-- Check for working C compiler: /usr/bin/gcc -- works
-- Detecting C compiler ABI info
-- Detecting C compiler ABI info - done
-- Check for working CXX compiler: /usr/bin/c++
-- Check for working CXX compiler: /usr/bin/c++ -- works
-- Detecting CXX compiler ABI info
-- Detecting CXX compiler ABI info - done
-- OpenMW pre-built binaries not found.  Using standard locations.
-- Looking for include file pthread.h
-- Looking for include file pthread.h - found
-- Looking for pthread_create
-- Looking for pthread_create - not found.
-- Looking for pthread_create in pthreads
-- Looking for pthread_create in pthreads - not found
-- Looking for pthread_create in pthread
-- Looking for pthread_create in pthread - found
-- Found Threads: TRUE  
-- Looking for OGRE...
-- OGRE_PREFIX_WATCH changed.
-- Found PkgConfig: /usr/bin/pkg-config (found version "0.27") 
-- checking for module 'OGRE'
--   found OGRE, version 1.8.0
-- Found Ogre Byatis (1.8.0)
-- Found OGRE: optimized;/usr/lib/libOgreMain.so;debug;/usr/lib/libOgreMain.so
-- Looking for OGRE_Paging...
-- Found OGRE_Paging: optimized;/usr/lib/libOgrePaging.so;debug;/usr/lib/libOgrePaging.so
-- Looking for OGRE_Terrain...
-- Found OGRE_Terrain: optimized;/usr/lib/libOgreTerrain.so;debug;/usr/lib/libOgreTerrain.so
-- Looking for OGRE_Property...
-- Found OGRE_Property: optimized;/usr/lib/libOgreProperty.so;debug;/usr/lib/libOgreProperty.so
-- Looking for OGRE_RTShaderSystem...
-- Found OGRE_RTShaderSystem: optimized;/usr/lib/libOgreRTShaderSystem.so;debug;/usr/lib/libOgreRTShaderSystem.so
-- checking for one of the modules 'MYGUI;MyGUI'
--  libraries : MyGUIEngine from /usr/lib
--  includes : /usr/include/MYGUI
-- Boost version: 1.49.0
-- Found the following Boost libraries:
--   system
--   filesystem
--   program_options
--   thread
-- Looking for OIS...
-- OIS_PREFIX_PATH changed.
-- checking for module 'OIS'
--   found OIS, version 1.3.0
-- Found OIS: optimized;/usr/lib/libOIS.so;debug;/usr/lib/libOIS.so
-- Found OpenAL: /usr/lib/libopenal.so  
-- Found Bullet: /usr/lib/libBulletDynamics.so  
-- Looking for Q_WS_X11
-- Looking for Q_WS_X11 - found
-- Looking for Q_WS_WIN
-- Looking for Q_WS_WIN - not found.
-- Looking for Q_WS_QWS
-- Looking for Q_WS_QWS - not found.
-- Looking for Q_WS_MAC
-- Looking for Q_WS_MAC - not found.
-- Found Qt4: /usr/bin/qmake (found version "4.8.2") 
-- Configuring done
-- Generating done
-- Build files have been written to: /build/src/openmw-0.16.0-source
Scanning dependencies of target components
[  0%] [  0%] [  0%] [  1%] Building CXX object components/CMakeFiles/components.dir/nifoverrides/nifoverrides.cpp.o
Building CXX object components/CMakeFiles/components.dir/bsa/bsa_archive.cpp.o
Building CXX object components/CMakeFiles/components.dir/settings/settings.cpp.o
Building CXX object components/CMakeFiles/components.dir/bsa/bsa_file.cpp.o
In file included from /usr/include/boost/thread/pthread/mutex.hpp:14:0,
                 from /usr/include/boost/thread/mutex.hpp:16,
                 from /usr/include/boost/thread/pthread/thread_data.hpp:12,
                 from /usr/include/boost/thread/pthread/condition_variable.hpp:10,
                 from /usr/include/boost/thread/condition_variable.hpp:16,
                 from /usr/include/boost/thread/condition.hpp:9,
                 from /usr/include/OGRE/Threading/OgreThreadHeadersBoost.h:31,
                 from /usr/include/OGRE/Threading/OgreThreadHeaders.h:30,
                 from /usr/include/OGRE/OgreStdHeaders.h:122,
                 from /usr/include/OGRE/OgrePrerequisites.h:334,
                 from /usr/include/OGRE/OgreConfigFile.h:31,
                 from /build/src/openmw-0.16.0-source/components/settings/settings.hpp:4,
                 from /build/src/openmw-0.16.0-source/components/settings/settings.cpp:1:
/usr/include/boost/thread/xtime.hpp:23:5: error: expected identifier before numeric constant
/usr/include/boost/thread/xtime.hpp:23:5: error: expected '}' before numeric constant
/usr/include/boost/thread/xtime.hpp:23:5: error: expected unqualified-id before numeric constant
/usr/include/boost/thread/xtime.hpp:46:14: error: expected type-specifier before 'system_time'
In file included from /usr/include/boost/thread/pthread/mutex.hpp:14:0,
                 from /usr/include/boost/thread/mutex.hpp:16,
                 from /usr/include/boost/thread/pthread/thread_data.hpp:12,
                 from /usr/include/boost/thread/pthread/condition_variable.hpp:10,
                 from /usr/include/boost/thread/condition_variable.hpp:16,
                 from /usr/include/boost/thread/condition.hpp:9,
                 from /usr/include/OGRE/Threading/OgreThreadHeadersBoost.h:31,
                 from /usr/include/OGRE/Threading/OgreThreadHeaders.h:30,
                 from /usr/include/OGRE/OgreStdHeaders.h:122,
                 from /usr/include/OGRE/OgrePrerequisites.h:334,
                 from /usr/include/OGRE/OgreConfigFile.h:31,
                 from /build/src/openmw-0.16.0-source/components/settings/settings.hpp:4,
                 from /build/src/openmw-0.16.0-source/components/settings/settings.cpp:1:
/usr/include/boost/thread/xtime.hpp: In function 'int xtime_get(xtime*, int)':
/usr/include/boost/thread/xtime.hpp:73:40: error: 'get_system_time' was not declared in this scope
/usr/include/boost/thread/xtime.hpp:73:40: note: suggested alternative:
In file included from /usr/include/boost/thread/locks.hpp:12:0,
                 from /usr/include/boost/thread/pthread/recursive_mutex.hpp:12,
                 from /usr/include/boost/thread/recursive_mutex.hpp:16,
                 from /usr/include/OGRE/Threading/OgreThreadHeadersBoost.h:30,
                 from /usr/include/OGRE/Threading/OgreThreadHeaders.h:30,
                 from /usr/include/OGRE/OgreStdHeaders.h:122,
                 from /usr/include/OGRE/OgrePrerequisites.h:334,
                 from /usr/include/OGRE/OgreConfigFile.h:31,
                 from /build/src/openmw-0.16.0-source/components/settings/settings.hpp:4,
                 from /build/src/openmw-0.16.0-source/components/settings/settings.cpp:1:
/usr/include/boost/thread/thread_time.hpp:19:24: note:   'boost::get_system_time'
In file included from /usr/include/boost/thread/pthread/mutex.hpp:14:0,
                 from /usr/include/boost/thread/mutex.hpp:16,
                 from /usr/include/boost/thread/pthread/thread_data.hpp:12,
                 from /usr/include/boost/thread/pthread/condition_variable.hpp:10,
                 from /usr/include/boost/thread/condition_variable.hpp:16,
                 from /usr/include/boost/thread/condition.hpp:9,
                 from /usr/include/OGRE/Threading/OgreThreadHeadersBoost.h:31,
                 from /usr/include/OGRE/Threading/OgreThreadHeaders.h:30,
                 from /usr/include/OGRE/OgreStdHeaders.h:122,
                 from /usr/include/OGRE/OgrePrerequisites.h:334,
                 from /usr/include/OGRE/OgreConfigFile.h:31,
                 from /build/src/openmw-0.16.0-source/components/settings/settings.hpp:4,
                 from /build/src/openmw-0.16.0-source/components/settings/settings.cpp:1:
/usr/include/boost/thread/xtime.hpp: At global scope:
/usr/include/boost/thread/xtime.hpp:88:1: error: expected declaration before '}' token
[  1%] Building CXX object components/CMakeFiles/components.dir/nif/nif_file.cpp.o
make[2]: *** [components/CMakeFiles/components.dir/settings/settings.cpp.o] Error 1
make[2]: *** Waiting for unfinished jobs....
In file included from /usr/include/boost/thread/pthread/mutex.hpp:14:0,
                 from /usr/include/boost/thread/mutex.hpp:16,
                 from /usr/include/boost/thread/pthread/thread_data.hpp:12,
                 from /usr/include/boost/thread/pthread/condition_variable.hpp:10,
                 from /usr/include/boost/thread/condition_variable.hpp:16,
                 from /usr/include/boost/thread/condition.hpp:9,
                 from /usr/include/OGRE/Threading/OgreThreadHeadersBoost.h:31,
                 from /usr/include/OGRE/Threading/OgreThreadHeaders.h:30,
                 from /usr/include/OGRE/OgreStdHeaders.h:122,
                 from /usr/include/OGRE/OgrePrerequisites.h:334,
                 from /usr/include/OGRE/OgreConfigFile.h:31,
                 from /build/src/openmw-0.16.0-source/components/nifoverrides/nifoverrides.hpp:4,
                 from /build/src/openmw-0.16.0-source/components/nifoverrides/nifoverrides.cpp:1:
/usr/include/boost/thread/xtime.hpp:23:5: error: expected identifier before numeric constant
/usr/include/boost/thread/xtime.hpp:23:5: error: expected '}' before numeric constant
/usr/include/boost/thread/xtime.hpp:23:5: error: expected unqualified-id before numeric constant
/usr/include/boost/thread/xtime.hpp:46:14: error: expected type-specifier before 'system_time'
In file included from /usr/include/boost/thread/pthread/mutex.hpp:14:0,
                 from /usr/include/boost/thread/mutex.hpp:16,
                 from /usr/include/boost/thread/pthread/thread_data.hpp:12,
                 from /usr/include/boost/thread/pthread/condition_variable.hpp:10,
                 from /usr/include/boost/thread/condition_variable.hpp:16,
                 from /usr/include/boost/thread/condition.hpp:9,
                 from /usr/include/OGRE/Threading/OgreThreadHeadersBoost.h:31,
                 from /usr/include/OGRE/Threading/OgreThreadHeaders.h:30,
                 from /usr/include/OGRE/OgreStdHeaders.h:122,
                 from /usr/include/OGRE/OgrePrerequisites.h:334,
                 from /usr/include/OGRE/OgreConfigFile.h:31,
                 from /build/src/openmw-0.16.0-source/components/nifoverrides/nifoverrides.hpp:4,
                 from /build/src/openmw-0.16.0-source/components/nifoverrides/nifoverrides.cpp:1:
/usr/include/boost/thread/xtime.hpp: In function 'int xtime_get(xtime*, int)':
/usr/include/boost/thread/xtime.hpp:73:40: error: 'get_system_time' was not declared in this scope
/usr/include/boost/thread/xtime.hpp:73:40: note: suggested alternative:
In file included from /usr/include/boost/thread/locks.hpp:12:0,
                 from /usr/include/boost/thread/pthread/recursive_mutex.hpp:12,
                 from /usr/include/boost/thread/recursive_mutex.hpp:16,
                 from /usr/include/OGRE/Threading/OgreThreadHeadersBoost.h:30,
                 from /usr/include/OGRE/Threading/OgreThreadHeaders.h:30,
                 from /usr/include/OGRE/OgreStdHeaders.h:122,
                 from /usr/include/OGRE/OgrePrerequisites.h:334,
                 from /usr/include/OGRE/OgreConfigFile.h:31,
                 from /build/src/openmw-0.16.0-source/components/nifoverrides/nifoverrides.hpp:4,
                 from /build/src/openmw-0.16.0-source/components/nifoverrides/nifoverrides.cpp:1:
/usr/include/boost/thread/thread_time.hpp:19:24: note:   'boost::get_system_time'
In file included from /usr/include/boost/thread/pthread/mutex.hpp:14:0,
                 from /usr/include/boost/thread/mutex.hpp:16,
                 from /usr/include/boost/thread/pthread/thread_data.hpp:12,
                 from /usr/include/boost/thread/pthread/condition_variable.hpp:10,
                 from /usr/include/boost/thread/condition_variable.hpp:16,
                 from /usr/include/boost/thread/condition.hpp:9,
                 from /usr/include/OGRE/Threading/OgreThreadHeadersBoost.h:31,
                 from /usr/include/OGRE/Threading/OgreThreadHeaders.h:30,
                 from /usr/include/OGRE/OgreStdHeaders.h:122,
                 from /usr/include/OGRE/OgrePrerequisites.h:334,
                 from /usr/include/OGRE/OgreConfigFile.h:31,
                 from /build/src/openmw-0.16.0-source/components/nifoverrides/nifoverrides.hpp:4,
                 from /build/src/openmw-0.16.0-source/components/nifoverrides/nifoverrides.cpp:1:
/usr/include/boost/thread/xtime.hpp: At global scope:
/usr/include/boost/thread/xtime.hpp:88:1: error: expected declaration before '}' token
make[2]: *** [components/CMakeFiles/components.dir/nifoverrides/nifoverrides.cpp.o] Error 1
In file included from /usr/include/boost/thread/pthread/mutex.hpp:14:0,
                 from /usr/include/boost/thread/mutex.hpp:16,
                 from /usr/include/boost/thread/pthread/thread_data.hpp:12,
                 from /usr/include/boost/thread/pthread/condition_variable.hpp:10,
                 from /usr/include/boost/thread/condition_variable.hpp:16,
                 from /usr/include/boost/thread/condition.hpp:9,
                 from /usr/include/OGRE/Threading/OgreThreadHeadersBoost.h:31,
                 from /usr/include/OGRE/Threading/OgreThreadHeaders.h:30,
                 from /usr/include/OGRE/OgreStdHeaders.h:122,
                 from /usr/include/OGRE/OgrePrerequisites.h:334,
                 from /usr/include/OGRE/OgreFileSystem.h:31,
                 from /build/src/openmw-0.16.0-source/components/bsa/bsa_archive.cpp:26:
/usr/include/boost/thread/xtime.hpp:23:5: error: expected identifier before numeric constant
/usr/include/boost/thread/xtime.hpp:23:5: error: expected '}' before numeric constant
/usr/include/boost/thread/xtime.hpp:23:5: error: expected unqualified-id before numeric constant
/usr/include/boost/thread/xtime.hpp:46:14: error: expected type-specifier before 'system_time'
In file included from /usr/include/boost/thread/pthread/mutex.hpp:14:0,
                 from /usr/include/boost/thread/mutex.hpp:16,
                 from /usr/include/boost/thread/pthread/thread_data.hpp:12,
                 from /usr/include/boost/thread/pthread/condition_variable.hpp:10,
                 from /usr/include/boost/thread/condition_variable.hpp:16,
                 from /usr/include/boost/thread/condition.hpp:9,
                 from /usr/include/OGRE/Threading/OgreThreadHeadersBoost.h:31,
                 from /usr/include/OGRE/Threading/OgreThreadHeaders.h:30,
                 from /usr/include/OGRE/OgreStdHeaders.h:122,
                 from /usr/include/OGRE/OgrePrerequisites.h:334,
                 from /usr/include/OGRE/OgreFileSystem.h:31,
                 from /build/src/openmw-0.16.0-source/components/bsa/bsa_archive.cpp:26:
/usr/include/boost/thread/xtime.hpp: In function 'int xtime_get(xtime*, int)':
/usr/include/boost/thread/xtime.hpp:73:40: error: 'get_system_time' was not declared in this scope
/usr/include/boost/thread/xtime.hpp:73:40: note: suggested alternative:
In file included from /usr/include/boost/thread/locks.hpp:12:0,
                 from /usr/include/boost/thread/pthread/recursive_mutex.hpp:12,
                 from /usr/include/boost/thread/recursive_mutex.hpp:16,
                 from /usr/include/OGRE/Threading/OgreThreadHeadersBoost.h:30,
                 from /usr/include/OGRE/Threading/OgreThreadHeaders.h:30,
                 from /usr/include/OGRE/OgreStdHeaders.h:122,
                 from /usr/include/OGRE/OgrePrerequisites.h:334,
                 from /usr/include/OGRE/OgreFileSystem.h:31,
                 from /build/src/openmw-0.16.0-source/components/bsa/bsa_archive.cpp:26:
/usr/include/boost/thread/thread_time.hpp:19:24: note:   'boost::get_system_time'
In file included from /usr/include/boost/thread/pthread/mutex.hpp:14:0,
                 from /usr/include/boost/thread/mutex.hpp:16,
                 from /usr/include/boost/thread/pthread/thread_data.hpp:12,
                 from /usr/include/boost/thread/pthread/condition_variable.hpp:10,
                 from /usr/include/boost/thread/condition_variable.hpp:16,
                 from /usr/include/boost/thread/condition.hpp:9,
                 from /usr/include/OGRE/Threading/OgreThreadHeadersBoost.h:31,
                 from /usr/include/OGRE/Threading/OgreThreadHeaders.h:30,
                 from /usr/include/OGRE/OgreStdHeaders.h:122,
                 from /usr/include/OGRE/OgrePrerequisites.h:334,
                 from /usr/include/OGRE/OgreFileSystem.h:31,
                 from /build/src/openmw-0.16.0-source/components/bsa/bsa_archive.cpp:26:
/usr/include/boost/thread/xtime.hpp: At global scope:
/usr/include/boost/thread/xtime.hpp:88:1: error: expected declaration before '}' token
make[2]: *** [components/CMakeFiles/components.dir/bsa/bsa_archive.cpp.o] Error 1
In file included from /usr/include/boost/thread/pthread/mutex.hpp:14:0,
                 from /usr/include/boost/thread/mutex.hpp:16,
                 from /usr/include/boost/thread/pthread/thread_data.hpp:12,
                 from /usr/include/boost/thread/pthread/condition_variable.hpp:10,
                 from /usr/include/boost/thread/condition_variable.hpp:16,
                 from /usr/include/boost/thread/condition.hpp:9,
                 from /usr/include/OGRE/Threading/OgreThreadHeadersBoost.h:31,
                 from /usr/include/OGRE/Threading/OgreThreadHeaders.h:30,
                 from /usr/include/OGRE/OgreStdHeaders.h:122,
                 from /usr/include/OGRE/OgrePrerequisites.h:334,
                 from /usr/include/OGRE/Ogre.h:31,
                 from /build/src/openmw-0.16.0-source/components/nif/data.hpp:29,
                 from /build/src/openmw-0.16.0-source/components/nif/node.hpp:28,
                 from /build/src/openmw-0.16.0-source/components/nif/nif_file.cpp:30:
/usr/include/boost/thread/xtime.hpp:23:5: error: expected identifier before numeric constant
/usr/include/boost/thread/xtime.hpp:23:5: error: expected '}' before numeric constant
/usr/include/boost/thread/xtime.hpp:23:5: error: expected unqualified-id before numeric constant
/usr/include/boost/thread/xtime.hpp:46:14: error: expected type-specifier before 'system_time'
In file included from /usr/include/boost/thread/pthread/mutex.hpp:14:0,
                 from /usr/include/boost/thread/mutex.hpp:16,
                 from /usr/include/boost/thread/pthread/thread_data.hpp:12,
                 from /usr/include/boost/thread/pthread/condition_variable.hpp:10,
                 from /usr/include/boost/thread/condition_variable.hpp:16,
                 from /usr/include/boost/thread/condition.hpp:9,
                 from /usr/include/OGRE/Threading/OgreThreadHeadersBoost.h:31,
                 from /usr/include/OGRE/Threading/OgreThreadHeaders.h:30,
                 from /usr/include/OGRE/OgreStdHeaders.h:122,
                 from /usr/include/OGRE/OgrePrerequisites.h:334,
                 from /usr/include/OGRE/Ogre.h:31,
                 from /build/src/openmw-0.16.0-source/components/nif/data.hpp:29,
                 from /build/src/openmw-0.16.0-source/components/nif/node.hpp:28,
                 from /build/src/openmw-0.16.0-source/components/nif/nif_file.cpp:30:
/usr/include/boost/thread/xtime.hpp: In function 'int xtime_get(xtime*, int)':
/usr/include/boost/thread/xtime.hpp:73:40: error: 'get_system_time' was not declared in this scope
/usr/include/boost/thread/xtime.hpp:73:40: note: suggested alternative:
In file included from /usr/include/boost/thread/locks.hpp:12:0,
                 from /usr/include/boost/thread/pthread/recursive_mutex.hpp:12,
                 from /usr/include/boost/thread/recursive_mutex.hpp:16,
                 from /usr/include/OGRE/Threading/OgreThreadHeadersBoost.h:30,
                 from /usr/include/OGRE/Threading/OgreThreadHeaders.h:30,
                 from /usr/include/OGRE/OgreStdHeaders.h:122,
                 from /usr/include/OGRE/OgrePrerequisites.h:334,
                 from /usr/include/OGRE/Ogre.h:31,
                 from /build/src/openmw-0.16.0-source/components/nif/data.hpp:29,
                 from /build/src/openmw-0.16.0-source/components/nif/node.hpp:28,
                 from /build/src/openmw-0.16.0-source/components/nif/nif_file.cpp:30:
/usr/include/boost/thread/thread_time.hpp:19:24: note:   'boost::get_system_time'
In file included from /usr/include/boost/thread/pthread/mutex.hpp:14:0,
                 from /usr/include/boost/thread/mutex.hpp:16,
                 from /usr/include/boost/thread/pthread/thread_data.hpp:12,
                 from /usr/include/boost/thread/pthread/condition_variable.hpp:10,
                 from /usr/include/boost/thread/condition_variable.hpp:16,
                 from /usr/include/boost/thread/condition.hpp:9,
                 from /usr/include/OGRE/Threading/OgreThreadHeadersBoost.h:31,
                 from /usr/include/OGRE/Threading/OgreThreadHeaders.h:30,
                 from /usr/include/OGRE/OgreStdHeaders.h:122,
                 from /usr/include/OGRE/OgrePrerequisites.h:334,
                 from /usr/include/OGRE/Ogre.h:31,
                 from /build/src/openmw-0.16.0-source/components/nif/data.hpp:29,
                 from /build/src/openmw-0.16.0-source/components/nif/node.hpp:28,
                 from /build/src/openmw-0.16.0-source/components/nif/nif_file.cpp:30:
/usr/include/boost/thread/xtime.hpp: At global scope:
/usr/include/boost/thread/xtime.hpp:88:1: error: expected declaration before '}' token
make[2]: *** [components/CMakeFiles/components.dir/nif/nif_file.cpp.o] Error 1
make[1]: *** [components/CMakeFiles/components.dir/all] Error 2
make: *** [all] Error 2
==> ERROR: A failure occurred in build().
    Aborting...
==> ERROR: Build failed, check /var/lib/archbuild/extra-x86_64/td123/build