1
2
3
4
5
6
7
8
9
10
11
12
13
14
15
16
17
18
19
20
21
22
23
24
25
26
27
28
29
30
31
32
33
34
35
36
37
38
39
40
41
42
43
44
45
46
47
48
49
50
51
52
53
54
55
56
57
58
59
60
61
62
63
64
65
66
67
68
69
70
71
72
73
74
75
76
77
78
79
80
81
82
83
84
85
86
87
88
89
90
91
92
93
94
95
96
97
98
99
100
Download directory : /tmp/rbdev-dl (set RBDEV_DOWNLOAD to change)
Install prefix     : /usr/local  (set RBDEV_PREFIX to change)
Build dir          : /tmp/rbdev-build (set RBDEV_BUILD to change)
Make options       :  (set MAKEFLAGS to change)

Select target arch:
s   - sh       (Archos models)
m   - m68k     (iriver h1x0/h3x0, iaudio m3/m5/x5 and mpio hd200)
a   - arm      (ipods, iriver H10, Sansa, D2, Gigabeat, etc)
i   - mips     (Jz4740 and ATJ-based players)
r   - arm-app  (Samsung ypr0)
separate multiple targets with spaces
(Example: "s m a" will build sh, m68k and arm)

r

ROCKBOXDEV: Skipping download of http://www.rockbox.org/gcc/ypr0/ct-ng-config: File already exists
ROCKBOXDEV: Skipping download of http://www.rockbox.org/gcc/ypr0/alsalib.tar.gz: File already exists
[INFO ]  Performing some trivial sanity checks
[INFO ]  Build started 20120505.193203
[INFO ]  Building environment variables
[EXTRA]  Preparing working directories
[EXTRA]  Installing user-supplied crosstool-NG configuration
[EXTRA]  =================================================================
[EXTRA]  Dumping internal crosstool-NG configuration
[EXTRA]    Building a toolchain for:
[EXTRA]      build  = x86_64-unknown-linux-gnu
[EXTRA]      host   = x86_64-unknown-linux-gnu
[EXTRA]      target = arm-ypr0-linux-gnueabi
[EXTRA]  Dumping internal crosstool-NG configuration: done in 0.33s (at 00:07)
[INFO ]  =================================================================
[INFO ]  Retrieving needed toolchain components' tarballs
[EXTRA]    Retrieving 'linux-2.6.27.59'
[EXTRA]    Retrieving 'gmp-4.3.2'
[EXTRA]    Retrieving 'mpfr-3.0.0'
[EXTRA]    Retrieving 'ppl-0.10.2'
[EXTRA]    Retrieving 'cloog-ppl-0.15.10'
[EXTRA]    Retrieving 'binutils-2.21.1a'
[EXTRA]    Retrieving 'gcc-4.4.6'
[EXTRA]    Retrieving 'eglibc-2_12'
[EXTRA]    Retrieving 'eglibc-ports-2_12'
[INFO ]  Retrieving needed toolchain components' tarballs: done in 271.87s (at 04:39)
[INFO ]  =================================================================
[INFO ]  Extracting and patching toolchain components
[EXTRA]    Extracting 'linux-2.6.27.59'
[EXTRA]    Patching 'linux-2.6.27.59'
[EXTRA]    Extracting 'gmp-4.3.2'
[EXTRA]    Patching 'gmp-4.3.2'
[EXTRA]    Extracting 'mpfr-3.0.0'
[EXTRA]    Patching 'mpfr-3.0.0'
[EXTRA]    Extracting 'ppl-0.10.2'
[EXTRA]    Patching 'ppl-0.10.2'
[EXTRA]    Extracting 'cloog-ppl-0.15.10'
[EXTRA]    Patching 'cloog-ppl-0.15.10'
[EXTRA]    Extracting 'binutils-2.21.1a'
[EXTRA]    Patching 'binutils-2.21.1a'
[EXTRA]    Extracting 'gcc-4.4.6'
[EXTRA]    Patching 'gcc-4.4.6'
[EXTRA]    Extracting 'eglibc-2_12'
[EXTRA]    Patching 'eglibc-2_12'
[EXTRA]    Extracting 'eglibc-ports-2_12'
[EXTRA]    Patching 'eglibc-ports-2_12'
[INFO ]  Extracting and patching toolchain components: done in 192.56s (at 07:52)
[INFO ]  =================================================================
[INFO ]  Installing GMP
[EXTRA]    Configuring GMP
[EXTRA]    Building GMP
[EXTRA]    Installing GMP
[INFO ]  Installing GMP: done in 219.27s (at 11:31)
[INFO ]  =================================================================
[INFO ]  Installing MPFR
[EXTRA]    Configuring MPFR
[EXTRA]    Building MPFR
[EXTRA]    Installing MPFR
[INFO ]  Installing MPFR: done in 58.96s (at 12:30)
[INFO ]  =================================================================
[INFO ]  Installing PPL
[EXTRA]    Configuring PPL
[EXTRA]    Building PPL
[ERROR]    /tmp/rbdev-build/build-ypr0/.build/src/ppl-0.10.2/src/Interval.defs.hh:451:86: error: 'f_info' was not declared in this scope, and no declarations were found by argument-dependent lookup at the point of instantiation [-fpermissive]
[ERROR]    /tmp/rbdev-build/build-ypr0/.build/src/ppl-0.10.2/src/Interval.defs.hh:390:86: error: 'f_info' was not declared in this scope, and no declarations were found by argument-dependent lookup at the point of instantiation [-fpermissive]
[ERROR]    /tmp/rbdev-build/build-ypr0/.build/src/ppl-0.10.2/src/Interval.defs.hh:432:5: error: 'f_info' was not declared in this scope, and no declarations were found by argument-dependent lookup at the point of instantiation [-fpermissive]
[ERROR]    /tmp/rbdev-build/build-ypr0/.build/src/ppl-0.10.2/src/Interval.defs.hh:492:5: error: 'f_info' was not declared in this scope, and no declarations were found by argument-dependent lookup at the point of instantiation [-fpermissive]
[ERROR]    /tmp/rbdev-build/build-ypr0/.build/src/ppl-0.10.2/src/Interval.defs.hh:390:86: error: 'f_info' was not declared in this scope, and no declarations were found by argument-dependent lookup at the point of instantiation [-fpermissive]
[ERROR]    /tmp/rbdev-build/build-ypr0/.build/src/ppl-0.10.2/src/Interval.defs.hh:451:86: error: 'f_info' was not declared in this scope, and no declarations were found by argument-dependent lookup at the point of instantiation [-fpermissive]
[ERROR]    make[4]: *** [Polyhedron_widenings.lo] Error 1
[ERROR]    make[3]: *** [all] Error 2
[ERROR]    make[2]: *** [all-recursive] Error 1
[ERROR]    make[1]: *** [all] Error 2
[ERROR]    
[ERROR]    >>
[ERROR]    >>  Error happened in: main[scripts/crosstool-NG.sh]
[ERROR]    >>
[ERROR]    >>  There is a list of known issues, some with workarounds, in:
[ERROR]    >>      '/usr/local/share/doc/ct-ng-1.13.2/B - Known issues.txt'
[ERROR]    
[ERROR]    Build failed in step 'Extracting and patching toolchain components'
[ERROR]    
[ERROR]    (elapsed: 16:17.72)
[16:18] / make: *** [build] Error 2