Started by user anonymous
Checkout:workspace / /var/lib/jenkins/jobs/TestProject/workspace - hudson.remoting.LocalChannel@1866002
Using strategy: Default
Last Built Revision: Revision c5c03bbedd76b1be867becdb2c02d0567a1d3eb2 (origin/HEAD, origin/deploy)
Checkout:workspace / /var/lib/jenkins/jobs/TestProject/workspace - hudson.remoting.LocalChannel@1866002
Fetching changes from 1 remote Git repository
Fetching upstream changes from file:///var/www/html/app/current
Seen branch in repository origin/HEAD
Seen branch in repository origin/deploy
Seen branch in repository origin/master
Commencing build of Revision c5c03bbedd76b1be867becdb2c02d0567a1d3eb2 (origin/HEAD, origin/deploy)
Checking out Revision c5c03bbedd76b1be867becdb2c02d0567a1d3eb2 (origin/HEAD, origin/deploy)
Warning : There are multiple branch changesets here
[workspace] $ ant
Buildfile: build.xml

clean:
   [delete] Deleting directory /var/lib/jenkins/jobs/TestProject/workspace/build/api
   [delete] Deleting directory /var/lib/jenkins/jobs/TestProject/workspace/build/code-browser
   [delete] Deleting directory /var/lib/jenkins/jobs/TestProject/workspace/build/coverage
   [delete] Deleting directory /var/lib/jenkins/jobs/TestProject/workspace/build/logs
   [delete] Deleting directory /var/lib/jenkins/jobs/TestProject/workspace/build/pdepend
    [mkdir] Created dir: /var/lib/jenkins/jobs/TestProject/workspace/build/api
    [mkdir] Created dir: /var/lib/jenkins/jobs/TestProject/workspace/build/code-browser
    [mkdir] Created dir: /var/lib/jenkins/jobs/TestProject/workspace/build/coverage
    [mkdir] Created dir: /var/lib/jenkins/jobs/TestProject/workspace/build/logs
    [mkdir] Created dir: /var/lib/jenkins/jobs/TestProject/workspace/build/pdepend

parallelTasks:

phpcpd:

pdepend:

phpcs:

phpdoc:

phploc:

BUILD FAILED
/var/lib/jenkins/jobs/TestProject/workspace/build.xml:30: 
The following error occurred while executing this line:
/var/lib/jenkins/jobs/TestProject/workspace/build.xml:42: Execute failed: java.io.IOException: Cannot run program "pdepend": java.io.IOException: error=2, No such file or directory
The following error occurred while executing this line:
/var/lib/jenkins/jobs/TestProject/workspace/build.xml:63: Execute failed: java.io.IOException: Cannot run program "phpcpd": java.io.IOException: error=2, No such file or directory
The following error occurred while executing this line:
/var/lib/jenkins/jobs/TestProject/workspace/build.xml:81: Execute failed: java.io.IOException: Cannot run program "phpcs": java.io.IOException: error=2, No such file or directory
The following error occurred while executing this line:
/var/lib/jenkins/jobs/TestProject/workspace/build.xml:91: Execute failed: java.io.IOException: Cannot run program "phpdoc": java.io.IOException: error=2, No such file or directory
The following error occurred while executing this line:
/var/lib/jenkins/jobs/TestProject/workspace/build.xml:72: Execute failed: java.io.IOException: Cannot run program "phploc": java.io.IOException: error=2, No such file or directory

Total time: 0 seconds
Build step 'Invoke Ant' marked build as failure
[CHECKSTYLE] Collecting checkstyle analysis files...
[PMD] Collecting PMD analysis files...
[DRY] Collecting duplicate code analysis files...
Recording plot data
Publishing Clover coverage report...
Clover xml file does not exist in: /var/lib/jenkins/jobs/TestProject/workspace called: build/logs/clover.xml and will not be copied to: /var/lib/jenkins/jobs/TestProject/builds/2011-09-09_14-22-23/cloverphp/clover.xml
Could not find 'build/coverage/build/logs/clover.xml'.  Did you generate the XML report for Clover?
[htmlpublisher] Archiving HTML reports...
[htmlpublisher] Archiving at BUILD level /var/lib/jenkins/jobs/TestProject/workspace/build/api to /var/lib/jenkins/jobs/TestProject/builds/2011-09-09_14-22-23/htmlreports/API_Documentation
ERROR: Directory '/var/lib/jenkins/jobs/TestProject/workspace/build/api' exists but failed copying to '/var/lib/jenkins/jobs/TestProject/builds/2011-09-09_14-22-23/htmlreports/API_Documentation'.
[xUnit] [INFO] - Starting to record.
[xUnit] [INFO] - Processing PHPUnit-3.4 (default)
[xUnit] [WARNING] - Can't create the path /var/lib/jenkins/jobs/TestProject/workspace/generatedJUnitFiles. Maybe the directory already exists.
[xUnit] [INFO] - [PHPUnit-3.4 (default)] - No test report file(s) were found with the pattern 'build/logs/junit.xml' relative to '/var/lib/jenkins/jobs/TestProject/workspace' for the testing framework 'PHPUnit-3.4 (default)'.  Did you enter a pattern relative to the correct directory?  Did you generate the result report(s) for 'PHPUnit-3.4 (default)'?
[xUnit] [ERROR] - No test reports found for the metric 'PHPUnit-3.4 (default)' with the resolved pattern 'build/logs/junit.xml'. Configuration error?.
[xUnit] [INFO] - Stopping recording.
[JDepend] JDepend plugin is ready
[JDepend] Couldn't generate JDepend file at 'build/logs/jdepend.xml'java.io.FileNotFoundException: /var/lib/jenkins/jobs/TestProject/workspace/build/logs/jdepend.xml (No such file or directory)
Finished: FAILURE