1
2
3
4
5
6
7
8
9
10
11
12
13
14
15
16
17
18
19
20
21
22
23
24
25
26
27
28
29
30
31
32
33
34
35
36
37
38
39
40
41
42
43
44
45
46
47
48
49
50
51
52
53
54
55
56
57
58
59
60
61
62
63
64
65
66
67
68
69
70
71
72
73
74
75
76
77
78
79
80
81
82
83
84
85
86
87
88
89
90
91
92
93
------------------------------------------------------------
/usr/local/bin/pip run on Tue Jul 26 18:52:43 2011
Downloading/unpacking pil
  Running setup.py egg_info for package pil
    running egg_info
    writing pip-egg-info/PIL.egg-info/PKG-INFO
    writing top-level names to pip-egg-info/PIL.egg-info/top_level.txt
    writing dependency_links to pip-egg-info/PIL.egg-info/dependency_links.txt
    warning: manifest_maker: standard file '-c' not found
    reading manifest file 'pip-egg-info/PIL.egg-info/SOURCES.txt'
    writing manifest file 'pip-egg-info/PIL.egg-info/SOURCES.txt'
Installing collected packages: pil
  Running setup.py install for pil
    Running command /usr/bin/python -c "import setuptools;__file__='/Users/cromestant/build/pil/setup.py';exec(compile(open(__file__).read().replace('\r\n', '\n'), __file__, 'exec'))" install --single-version-externally-managed --record /tmp/pip-EoKTTn-record/install-record.txt
    running install
    running build
    running build_py
    running build_ext
    --- using frameworks at /System/Library/Frameworks
    building '_imaging' extension
    gcc-4.2 -fno-strict-aliasing -fno-common -dynamic -DNDEBUG -g -fwrapv -Os -Wall -Wstrict-prototypes -DENABLE_DTRACE -arch i386 -arch ppc -arch x86_64 -pipe -DHAVE_LIBJPEG -DHAVE_LIBZ -I/System/Library/Frameworks/Tcl.framework/Headers -I/System/Library/Frameworks/Tk.framework/Headers -I/opt/local/include/freetype2 -IlibImaging -I/opt/local/include -I/System/Library/Frameworks/Python.framework/Versions/2.6/include -I/usr/local/include -I/usr/include -I/System/Library/Frameworks/Python.framework/Versions/2.6/include/python2.6 -c _imaging.c -o build/temp.macosx-10.6-universal-2.6/_imaging.o
    _imaging.c:3017: warning: initialization from incompatible pointer type
    _imaging.c:3077: warning: initialization from incompatible pointer type
    /usr/libexec/gcc/powerpc-apple-darwin10/4.2.1/as: assembler (/usr/bin/../libexec/gcc/darwin/ppc/as or /usr/bin/../local/libexec/gcc/darwin/ppc/as) for architecture ppc not installed
    Installed assemblers are:
    /usr/bin/../libexec/gcc/darwin/x86_64/as for architecture x86_64
    /usr/bin/../libexec/gcc/darwin/i386/as for architecture i386
    _imaging.c:3017: warning: initialization from incompatible pointer type
    _imaging.c:3077: warning: initialization from incompatible pointer type
    _imaging.c:3281: fatal error: error writing to -: Broken pipe
    compilation terminated.
    _imaging.c:3017: warning: initialization from incompatible pointer type
    _imaging.c:3077: warning: initialization from incompatible pointer type
    lipo: can't open input file: /var/tmp//ccXYT7vS.out (No such file or directory)
    error: command 'gcc-4.2' failed with exit status 1
    Complete output from command /usr/bin/python -c "import setuptools;__file__='/Users/cromestant/build/pil/setup.py';exec(compile(open(__file__).read().replace('\r\n', '\n'), __file__, 'exec'))" install --single-version-externally-managed --record /tmp/pip-EoKTTn-record/install-record.txt:
    running install

running build

running build_py

running build_ext

--- using frameworks at /System/Library/Frameworks

building '_imaging' extension

gcc-4.2 -fno-strict-aliasing -fno-common -dynamic -DNDEBUG -g -fwrapv -Os -Wall -Wstrict-prototypes -DENABLE_DTRACE -arch i386 -arch ppc -arch x86_64 -pipe -DHAVE_LIBJPEG -DHAVE_LIBZ -I/System/Library/Frameworks/Tcl.framework/Headers -I/System/Library/Frameworks/Tk.framework/Headers -I/opt/local/include/freetype2 -IlibImaging -I/opt/local/include -I/System/Library/Frameworks/Python.framework/Versions/2.6/include -I/usr/local/include -I/usr/include -I/System/Library/Frameworks/Python.framework/Versions/2.6/include/python2.6 -c _imaging.c -o build/temp.macosx-10.6-universal-2.6/_imaging.o

_imaging.c:3017: warning: initialization from incompatible pointer type

_imaging.c:3077: warning: initialization from incompatible pointer type

/usr/libexec/gcc/powerpc-apple-darwin10/4.2.1/as: assembler (/usr/bin/../libexec/gcc/darwin/ppc/as or /usr/bin/../local/libexec/gcc/darwin/ppc/as) for architecture ppc not installed

Installed assemblers are:

/usr/bin/../libexec/gcc/darwin/x86_64/as for architecture x86_64

/usr/bin/../libexec/gcc/darwin/i386/as for architecture i386

_imaging.c:3017: warning: initialization from incompatible pointer type

_imaging.c:3077: warning: initialization from incompatible pointer type

_imaging.c:3281: fatal error: error writing to -: Broken pipe

compilation terminated.

_imaging.c:3017: warning: initialization from incompatible pointer type

_imaging.c:3077: warning: initialization from incompatible pointer type

lipo: can't open input file: /var/tmp//ccXYT7vS.out (No such file or directory)

error: command 'gcc-4.2' failed with exit status 1

----------------------------------------
Command /usr/bin/python -c "import setuptools;__file__='/Users/cromestant/build/pil/setup.py';exec(compile(open(__file__).read().replace('\r\n', '\n'), __file__, 'exec'))" install --single-version-externally-managed --record /tmp/pip-EoKTTn-record/install-record.txt failed with error code 1
Exception information:
Traceback (most recent call last):
  File "/Library/Python/2.6/site-packages/pip-1.0.2-py2.6.egg/pip/basecommand.py", line 126, in main
    self.run(options, args)
  File "/Library/Python/2.6/site-packages/pip-1.0.2-py2.6.egg/pip/commands/install.py", line 228, in run
    requirement_set.install(install_options, global_options)
  File "/Library/Python/2.6/site-packages/pip-1.0.2-py2.6.egg/pip/req.py", line 1100, in install
    requirement.install(install_options, global_options)
  File "/Library/Python/2.6/site-packages/pip-1.0.2-py2.6.egg/pip/req.py", line 572, in install
    cwd=self.source_dir, filter_stdout=self._filter_install, show_stdout=False)
  File "/Library/Python/2.6/site-packages/pip-1.0.2-py2.6.egg/pip/__init__.py", line 255, in call_subprocess
    % (command_desc, proc.returncode))
InstallationError: Command /usr/bin/python -c "import setuptools;__file__='/Users/cromestant/build/pil/setup.py';exec(compile(open(__file__).read().replace('\r\n', '\n'), __file__, 'exec'))" install --single-version-externally-managed --record /tmp/pip-EoKTTn-record/install-record.txt failed with error code 1