make all MYCFLAGS="-DLUA_RTEMS -I/opt/rtems-4.11/lm32-rtems4.11/milkymist/lib/include/" MYLIBS="-lm -B/opt/rtems-4.11/lm32-rtems4.11/milkymist/lib -specs bsp_specs -qrtems"
lm32-rtems4.11-gcc -O2 -Wall -DLUA_RTEMS -I/opt/rtems-4.11/lm32-rtems4.11/milkymist/lib/include/   -c -o lapi.o lapi.c
lm32-rtems4.11-gcc -O2 -Wall -DLUA_RTEMS -I/opt/rtems-4.11/lm32-rtems4.11/milkymist/lib/include/   -c -o lcode.o lcode.c
lm32-rtems4.11-gcc -O2 -Wall -DLUA_RTEMS -I/opt/rtems-4.11/lm32-rtems4.11/milkymist/lib/include/   -c -o ldebug.o ldebug.c
lm32-rtems4.11-gcc -O2 -Wall -DLUA_RTEMS -I/opt/rtems-4.11/lm32-rtems4.11/milkymist/lib/include/   -c -o ldo.o ldo.c
lm32-rtems4.11-gcc -O2 -Wall -DLUA_RTEMS -I/opt/rtems-4.11/lm32-rtems4.11/milkymist/lib/include/   -c -o ldump.o ldump.c
lm32-rtems4.11-gcc -O2 -Wall -DLUA_RTEMS -I/opt/rtems-4.11/lm32-rtems4.11/milkymist/lib/include/   -c -o lfunc.o lfunc.c
lm32-rtems4.11-gcc -O2 -Wall -DLUA_RTEMS -I/opt/rtems-4.11/lm32-rtems4.11/milkymist/lib/include/   -c -o lgc.o lgc.c
lm32-rtems4.11-gcc -O2 -Wall -DLUA_RTEMS -I/opt/rtems-4.11/lm32-rtems4.11/milkymist/lib/include/   -c -o llex.o llex.c
lm32-rtems4.11-gcc -O2 -Wall -DLUA_RTEMS -I/opt/rtems-4.11/lm32-rtems4.11/milkymist/lib/include/   -c -o lmem.o lmem.c
lm32-rtems4.11-gcc -O2 -Wall -DLUA_RTEMS -I/opt/rtems-4.11/lm32-rtems4.11/milkymist/lib/include/   -c -o lobject.o lobject.c
lm32-rtems4.11-gcc -O2 -Wall -DLUA_RTEMS -I/opt/rtems-4.11/lm32-rtems4.11/milkymist/lib/include/   -c -o lopcodes.o lopcodes.c
lm32-rtems4.11-gcc -O2 -Wall -DLUA_RTEMS -I/opt/rtems-4.11/lm32-rtems4.11/milkymist/lib/include/   -c -o lparser.o lparser.c
lm32-rtems4.11-gcc -O2 -Wall -DLUA_RTEMS -I/opt/rtems-4.11/lm32-rtems4.11/milkymist/lib/include/   -c -o lstate.o lstate.c
lm32-rtems4.11-gcc -O2 -Wall -DLUA_RTEMS -I/opt/rtems-4.11/lm32-rtems4.11/milkymist/lib/include/   -c -o lstring.o lstring.c
lm32-rtems4.11-gcc -O2 -Wall -DLUA_RTEMS -I/opt/rtems-4.11/lm32-rtems4.11/milkymist/lib/include/   -c -o ltable.o ltable.c
lm32-rtems4.11-gcc -O2 -Wall -DLUA_RTEMS -I/opt/rtems-4.11/lm32-rtems4.11/milkymist/lib/include/   -c -o ltm.o ltm.c
lm32-rtems4.11-gcc -O2 -Wall -DLUA_RTEMS -I/opt/rtems-4.11/lm32-rtems4.11/milkymist/lib/include/   -c -o lundump.o lundump.c
lm32-rtems4.11-gcc -O2 -Wall -DLUA_RTEMS -I/opt/rtems-4.11/lm32-rtems4.11/milkymist/lib/include/   -c -o lvm.o lvm.c
lm32-rtems4.11-gcc -O2 -Wall -DLUA_RTEMS -I/opt/rtems-4.11/lm32-rtems4.11/milkymist/lib/include/   -c -o lzio.o lzio.c
lm32-rtems4.11-gcc -O2 -Wall -DLUA_RTEMS -I/opt/rtems-4.11/lm32-rtems4.11/milkymist/lib/include/   -c -o lauxlib.o lauxlib.c
lm32-rtems4.11-gcc -O2 -Wall -DLUA_RTEMS -I/opt/rtems-4.11/lm32-rtems4.11/milkymist/lib/include/   -c -o lbaselib.o lbaselib.c
lm32-rtems4.11-gcc -O2 -Wall -DLUA_RTEMS -I/opt/rtems-4.11/lm32-rtems4.11/milkymist/lib/include/   -c -o ldblib.o ldblib.c
lm32-rtems4.11-gcc -O2 -Wall -DLUA_RTEMS -I/opt/rtems-4.11/lm32-rtems4.11/milkymist/lib/include/   -c -o liolib.o liolib.c
lm32-rtems4.11-gcc -O2 -Wall -DLUA_RTEMS -I/opt/rtems-4.11/lm32-rtems4.11/milkymist/lib/include/   -c -o lmathlib.o lmathlib.c
lm32-rtems4.11-gcc -O2 -Wall -DLUA_RTEMS -I/opt/rtems-4.11/lm32-rtems4.11/milkymist/lib/include/   -c -o loslib.o loslib.c
lm32-rtems4.11-gcc -O2 -Wall -DLUA_RTEMS -I/opt/rtems-4.11/lm32-rtems4.11/milkymist/lib/include/   -c -o ltablib.o ltablib.c
lm32-rtems4.11-gcc -O2 -Wall -DLUA_RTEMS -I/opt/rtems-4.11/lm32-rtems4.11/milkymist/lib/include/   -c -o lstrlib.o lstrlib.c
lm32-rtems4.11-gcc -O2 -Wall -DLUA_RTEMS -I/opt/rtems-4.11/lm32-rtems4.11/milkymist/lib/include/   -c -o loadlib.o loadlib.c
lm32-rtems4.11-gcc -O2 -Wall -DLUA_RTEMS -I/opt/rtems-4.11/lm32-rtems4.11/milkymist/lib/include/   -c -o linit.o linit.c
lm32-rtems4.11-ar rcu liblua.a lapi.o lcode.o ldebug.o ldo.o ldump.o lfunc.o lgc.o llex.o lmem.o lobject.o lopcodes.o lparser.o lstate.o lstring.o ltable.o ltm.o lundump.o lvm.o lzio.o lauxlib.o lbaselib.o ldblib.o liolib.o lmathlib.o loslib.o ltablib.o lstrlib.o loadlib.o linit.o
lm32-rtems4.11-ranlib liblua.a
lm32-rtems4.11-gcc -O2 -Wall -DLUA_RTEMS -I/opt/rtems-4.11/lm32-rtems4.11/milkymist/lib/include/   -c -o lua.o lua.c
lm32-rtems4.11-gcc -o lua  lua.o liblua.a -lm -lm -B/opt/rtems-4.11/lm32-rtems4.11/milkymist/lib -specs bsp_specs -qrtems
lm32-rtems4.11-gcc -O2 -Wall -DLUA_RTEMS -I/opt/rtems-4.11/lm32-rtems4.11/milkymist/lib/include/   -c -o luac.o luac.c
lm32-rtems4.11-gcc -O2 -Wall -DLUA_RTEMS -I/opt/rtems-4.11/lm32-rtems4.11/milkymist/lib/include/   -c -o print.o print.c
lm32-rtems4.11-gcc -o luac  luac.o print.o liblua.a -lm -lm -B/opt/rtems-4.11/lm32-rtems4.11/milkymist/lib -specs bsp_specs -qrtems
lm32-rtems4.11-gcc -O2 -Wall -DLUA_RTEMS -I/opt/rtems-4.11/lm32-rtems4.11/milkymist/lib/include/   -c -o luam.o luam.c
luam.c: In function 'main':
luam.c:396:10: warning: assignment makes pointer from integer without a cast
In file included from /opt/rtems-4.11/lm32-rtems4.11/milkymist/lib/include/rtems/score/timestamp.h:45:0,
                 from /opt/rtems-4.11/lm32-rtems4.11/milkymist/lib/include/rtems/score/thread.h:51,
                 from /opt/rtems-4.11/lm32-rtems4.11/milkymist/lib/include/rtems/score/coremutex.h:37,
                 from /opt/rtems-4.11/lm32-rtems4.11/milkymist/lib/include/rtems/score/apimutex.h:37,
                 from /opt/rtems-4.11/lm32-rtems4.11/milkymist/lib/include/rtems/confdefs.h:46,
                 from luam.c:407:
/opt/rtems-4.11/lm32-rtems4.11/milkymist/lib/include/rtems/score/timespec.h: At top level:
/opt/rtems-4.11/lm32-rtems4.11/milkymist/lib/include/rtems/score/timespec.h:95:6: error: expected '=', ',', ';', 'asm' or '__attribute__' before '_Timespec_Is_valid'
/opt/rtems-4.11/lm32-rtems4.11/milkymist/lib/include/rtems/score/timespec.h:109:6: error: expected '=', ',', ';', 'asm' or '__attribute__' before '_Timespec_Less_than'
/opt/rtems-4.11/lm32-rtems4.11/milkymist/lib/include/rtems/score/timespec.h:124:6: error: expected '=', ',', ';', 'asm' or '__attribute__' before '_Timespec_Greater_than'
In file included from /opt/rtems-4.11/lm32-rtems4.11/milkymist/lib/include/rtems/score/context.h:33:0,
                 from /opt/rtems-4.11/lm32-rtems4.11/milkymist/lib/include/rtems/score/thread.h:58,
                 from /opt/rtems-4.11/lm32-rtems4.11/milkymist/lib/include/rtems/score/coremutex.h:37,
                 from /opt/rtems-4.11/lm32-rtems4.11/milkymist/lib/include/rtems/score/apimutex.h:37,
                 from /opt/rtems-4.11/lm32-rtems4.11/milkymist/lib/include/rtems/confdefs.h:46,
                 from luam.c:407:
/opt/rtems-4.11/lm32-rtems4.11/milkymist/lib/include/rtems/score/cpu.h:568:14: error: expected '=', ',', ';', 'asm' or '__attribute__' before 'void'
/opt/rtems-4.11/lm32-rtems4.11/milkymist/lib/include/rtems/score/cpu.h:575:14: error: expected '=', ',', ';', 'asm' or '__attribute__' before 'void'
/opt/rtems-4.11/lm32-rtems4.11/milkymist/lib/include/rtems/score/cpu.h:1109:3: error: expected declaration specifiers or '...' before 'proc_ptr'
/opt/rtems-4.11/lm32-rtems4.11/milkymist/lib/include/rtems/score/cpu.h:1110:3: error: expected declaration specifiers or '...' before 'proc_ptr'
/opt/rtems-4.11/lm32-rtems4.11/milkymist/lib/include/rtems/score/cpu.h:1127:3: error: expected declaration specifiers or '...' before 'proc_ptr'
/opt/rtems-4.11/lm32-rtems4.11/milkymist/lib/include/rtems/score/cpu.h:1128:3: error: expected declaration specifiers or '...' before 'proc_ptr'
In file included from /opt/rtems-4.11/lm32-rtems4.11/milkymist/lib/include/rtems/score/thread.h:58:0,
                 from /opt/rtems-4.11/lm32-rtems4.11/milkymist/lib/include/rtems/score/coremutex.h:37,
                 from /opt/rtems-4.11/lm32-rtems4.11/milkymist/lib/include/rtems/score/apimutex.h:37,
                 from /opt/rtems-4.11/lm32-rtems4.11/milkymist/lib/include/rtems/confdefs.h:46,
                 from luam.c:407:
/opt/rtems-4.11/lm32-rtems4.11/milkymist/lib/include/rtems/score/context.h:51:14: error: expected '=', ',', ';', 'asm' or '__attribute__' before 'volatile'
In file included from /opt/rtems-4.11/lm32-rtems4.11/milkymist/lib/include/rtems/score/address.h:34:0,
                 from /opt/rtems-4.11/lm32-rtems4.11/milkymist/lib/include/rtems/score/chain.h:37,
                 from /opt/rtems-4.11/lm32-rtems4.11/milkymist/lib/include/rtems/score/object.h:25,
                 from /opt/rtems-4.11/lm32-rtems4.11/milkymist/lib/include/rtems/score/thread.h:63,
                 from /opt/rtems-4.11/lm32-rtems4.11/milkymist/lib/include/rtems/score/coremutex.h:37,
                 from /opt/rtems-4.11/lm32-rtems4.11/milkymist/lib/include/rtems/score/apimutex.h:37,
                 from /opt/rtems-4.11/lm32-rtems4.11/milkymist/lib/include/rtems/confdefs.h:46,
                 from luam.c:407:
/opt/rtems-4.11/lm32-rtems4.11/milkymist/lib/include/rtems/score/address.inl:43:22: error: expected '=', ',', ';', 'asm' or '__attribute__' before 'void'
/opt/rtems-4.11/lm32-rtems4.11/milkymist/lib/include/rtems/score/address.inl:63:22: error: expected '=', ',', ';', 'asm' or '__attribute__' before 'void'
/opt/rtems-4.11/lm32-rtems4.11/milkymist/lib/include/rtems/score/address.inl:84:22: error: expected '=', ',', ';', 'asm' or '__attribute__' before 'int32_t'
/opt/rtems-4.11/lm32-rtems4.11/milkymist/lib/include/rtems/score/address.inl:103:22: error: expected '=', ',', ';', 'asm' or '__attribute__' before '_Bool'
/opt/rtems-4.11/lm32-rtems4.11/milkymist/lib/include/rtems/score/address.inl:129:22: error: expected '=', ',', ';', 'asm' or '__attribute__' before '_Bool'
In file included from /opt/rtems-4.11/lm32-rtems4.11/milkymist/lib/include/rtems/score/chain.h:189:0,
                 from /opt/rtems-4.11/lm32-rtems4.11/milkymist/lib/include/rtems/score/object.h:25,
                 from /opt/rtems-4.11/lm32-rtems4.11/milkymist/lib/include/rtems/score/thread.h:63,
                 from /opt/rtems-4.11/lm32-rtems4.11/milkymist/lib/include/rtems/score/coremutex.h:37,
                 from /opt/rtems-4.11/lm32-rtems4.11/milkymist/lib/include/rtems/score/apimutex.h:37,
                 from /opt/rtems-4.11/lm32-rtems4.11/milkymist/lib/include/rtems/confdefs.h:46,
                 from luam.c:407:
/opt/rtems-4.11/lm32-rtems4.11/milkymist/lib/include/rtems/score/chain.inl:42:22: error: expected '=', ',', ';', 'asm' or '__attribute__' before 'void'
/opt/rtems-4.11/lm32-rtems4.11/milkymist/lib/include/rtems/score/chain.inl:58:22: error: expected '=', ',', ';', 'asm' or '__attribute__' before '_Bool'
/opt/rtems-4.11/lm32-rtems4.11/milkymist/lib/include/rtems/score/chain.inl:76:22: error: expected '=', ',', ';', 'asm' or '__attribute__' before '_Bool'
/opt/rtems-4.11/lm32-rtems4.11/milkymist/lib/include/rtems/score/chain.inl:92:22: error: expected '=', ',', ';', 'asm' or '__attribute__' before '_Bool'
/opt/rtems-4.11/lm32-rtems4.11/milkymist/lib/include/rtems/score/chain.inl:107:22: error: expected '=', ',', ';', 'asm' or '__attribute__' before '_Bool'
/opt/rtems-4.11/lm32-rtems4.11/milkymist/lib/include/rtems/score/chain.inl:122:22: error: expected '=', ',', ';', 'asm' or '__attribute__' before 'Chain_Node'
/opt/rtems-4.11/lm32-rtems4.11/milkymist/lib/include/rtems/score/chain.inl:137:22: error: expected '=', ',', ';', 'asm' or '__attribute__' before 'Chain_Node'
/opt/rtems-4.11/lm32-rtems4.11/milkymist/lib/include/rtems/score/chain.inl:153:22: error: expected '=', ',', ';', 'asm' or '__attribute__' before 'Chain_Node'
/opt/rtems-4.11/lm32-rtems4.11/milkymist/lib/include/rtems/score/chain.inl:169:22: error: expected '=', ',', ';', 'asm' or '__attribute__' before 'Chain_Node'
/opt/rtems-4.11/lm32-rtems4.11/milkymist/lib/include/rtems/score/chain.inl:184:22: error: expected '=', ',', ';', 'asm' or '__attribute__' before 'Chain_Node'
/opt/rtems-4.11/lm32-rtems4.11/milkymist/lib/include/rtems/score/chain.inl:199:22: error: expected '=', ',', ';', 'asm' or '__attribute__' before 'Chain_Node'
/opt/rtems-4.11/lm32-rtems4.11/milkymist/lib/include/rtems/score/chain.inl:216:22: error: expected '=', ',', ';', 'asm' or '__attribute__' before '_Bool'
/opt/rtems-4.11/lm32-rtems4.11/milkymist/lib/include/rtems/score/chain.inl:234:22: error: expected '=', ',', ';', 'asm' or '__attribute__' before '_Bool'
/opt/rtems-4.11/lm32-rtems4.11/milkymist/lib/include/rtems/score/chain.inl:251:22: error: expected '=', ',', ';', 'asm' or '__attribute__' before '_Bool'
/opt/rtems-4.11/lm32-rtems4.11/milkymist/lib/include/rtems/score/chain.inl:268:22: error: expected '=', ',', ';', 'asm' or '__attribute__' before '_Bool'
/opt/rtems-4.11/lm32-rtems4.11/milkymist/lib/include/rtems/score/chain.inl:286:22: error: expected '=', ',', ';', 'asm' or '__attribute__' before '_Bool'
/opt/rtems-4.11/lm32-rtems4.11/milkymist/lib/include/rtems/score/chain.inl:302:22: error: expected '=', ',', ';', 'asm' or '__attribute__' before '_Bool'
/opt/rtems-4.11/lm32-rtems4.11/milkymist/lib/include/rtems/score/chain.inl:316:22: error: expected '=', ',', ';', 'asm' or '__attribute__' before 'void'
/opt/rtems-4.11/lm32-rtems4.11/milkymist/lib/include/rtems/score/chain.inl:333:22: error: expected '=', ',', ';', 'asm' or '__attribute__' before 'void'
/opt/rtems-4.11/lm32-rtems4.11/milkymist/lib/include/rtems/score/chain.inl:360:22: error: expected '=', ',', ';', 'asm' or '__attribute__' before 'Chain_Node'
/opt/rtems-4.11/lm32-rtems4.11/milkymist/lib/include/rtems/score/chain.inl:388:22: error: expected '=', ',', ';', 'asm' or '__attribute__' before 'Chain_Node'
/opt/rtems-4.11/lm32-rtems4.11/milkymist/lib/include/rtems/score/chain.inl:410:22: error: expected '=', ',', ';', 'asm' or '__attribute__' before 'void'
/opt/rtems-4.11/lm32-rtems4.11/milkymist/lib/include/rtems/score/chain.inl:434:22: error: expected '=', ',', ';', 'asm' or '__attribute__' before 'void'
/opt/rtems-4.11/lm32-rtems4.11/milkymist/lib/include/rtems/score/chain.inl:458:22: error: expected '=', ',', ';', 'asm' or '__attribute__' before 'void'
/opt/rtems-4.11/lm32-rtems4.11/milkymist/lib/include/rtems/score/chain.inl:476:22: error: expected '=', ',', ';', 'asm' or '__attribute__' before 'void'
In file included from /opt/rtems-4.11/lm32-rtems4.11/milkymist/lib/include/rtems/score/object.h:26:0,
                 from /opt/rtems-4.11/lm32-rtems4.11/milkymist/lib/include/rtems/score/thread.h:63,
                 from /opt/rtems-4.11/lm32-rtems4.11/milkymist/lib/include/rtems/score/coremutex.h:37,
                 from /opt/rtems-4.11/lm32-rtems4.11/milkymist/lib/include/rtems/score/apimutex.h:37,
                 from /opt/rtems-4.11/lm32-rtems4.11/milkymist/lib/include/rtems/confdefs.h:46,
                 from luam.c:407:
/opt/rtems-4.11/lm32-rtems4.11/milkymist/lib/include/rtems/score/isr.h:82:14: error: expected '=', ',', ';', 'asm' or '__attribute__' before '_Bool'
/opt/rtems-4.11/lm32-rtems4.11/milkymist/lib/include/rtems/score/isr.h:88:14: error: expected '=', ',', ';', 'asm' or '__attribute__' before 'volatile'
/opt/rtems-4.11/lm32-rtems4.11/milkymist/lib/include/rtems/score/isr.h:95:14: error: expected '=', ',', ';', 'asm' or '__attribute__' before 'ISR_Handler_entry'
In file included from /opt/rtems-4.11/lm32-rtems4.11/milkymist/lib/include/rtems/score/isr.h:221:0,
                 from /opt/rtems-4.11/lm32-rtems4.11/milkymist/lib/include/rtems/score/object.h:26,
                 from /opt/rtems-4.11/lm32-rtems4.11/milkymist/lib/include/rtems/score/thread.h:63,
                 from /opt/rtems-4.11/lm32-rtems4.11/milkymist/lib/include/rtems/score/coremutex.h:37,
                 from /opt/rtems-4.11/lm32-rtems4.11/milkymist/lib/include/rtems/score/apimutex.h:37,
                 from /opt/rtems-4.11/lm32-rtems4.11/milkymist/lib/include/rtems/confdefs.h:46,
                 from luam.c:407:
/opt/rtems-4.11/lm32-rtems4.11/milkymist/lib/include/rtems/score/isr.inl:36:22: error: expected '=', ',', ';', 'asm' or '__attribute__' before '_Bool'
/opt/rtems-4.11/lm32-rtems4.11/milkymist/lib/include/rtems/score/isr.inl:48:22: error: expected '=', ',', ';', 'asm' or '__attribute__' before '_Bool'
In file included from /opt/rtems-4.11/lm32-rtems4.11/milkymist/lib/include/rtems/score/thread.h:63:0,
                 from /opt/rtems-4.11/lm32-rtems4.11/milkymist/lib/include/rtems/score/coremutex.h:37,
                 from /opt/rtems-4.11/lm32-rtems4.11/milkymist/lib/include/rtems/score/apimutex.h:37,
                 from /opt/rtems-4.11/lm32-rtems4.11/milkymist/lib/include/rtems/confdefs.h:46,
                 from luam.c:407:
/opt/rtems-4.11/lm32-rtems4.11/milkymist/lib/include/rtems/score/object.h:409:14: error: expected '=', ',', ';', 'asm' or '__attribute__' before 'Objects_Information'
In file included from /opt/rtems-4.11/lm32-rtems4.11/milkymist/lib/include/rtems/score/object.h:898:0,
                 from /opt/rtems-4.11/lm32-rtems4.11/milkymist/lib/include/rtems/score/thread.h:63,
                 from /opt/rtems-4.11/lm32-rtems4.11/milkymist/lib/include/rtems/score/coremutex.h:37,
                 from /opt/rtems-4.11/lm32-rtems4.11/milkymist/lib/include/rtems/score/apimutex.h:37,
                 from /opt/rtems-4.11/lm32-rtems4.11/milkymist/lib/include/rtems/confdefs.h:46,
                 from luam.c:407:
/opt/rtems-4.11/lm32-rtems4.11/milkymist/lib/include/rtems/score/object.inl:39:22: error: expected '=', ',', ';', 'asm' or '__attribute__' before 'Objects_Id'
/opt/rtems-4.11/lm32-rtems4.11/milkymist/lib/include/rtems/score/object.inl:61:22: error: expected '=', ',', ';', 'asm' or '__attribute__' before 'Objects_APIs'
/opt/rtems-4.11/lm32-rtems4.11/milkymist/lib/include/rtems/score/object.inl:73:22: error: expected '=', ',', ';', 'asm' or '__attribute__' before 'uint32_t'
/opt/rtems-4.11/lm32-rtems4.11/milkymist/lib/include/rtems/score/object.inl:88:22: error: expected '=', ',', ';', 'asm' or '__attribute__' before 'uint32_t'
/opt/rtems-4.11/lm32-rtems4.11/milkymist/lib/include/rtems/score/object.inl:110:22: error: expected '=', ',', ';', 'asm' or '__attribute__' before 'Objects_Maximum'
/opt/rtems-4.11/lm32-rtems4.11/milkymist/lib/include/rtems/score/object.inl:127:22: error: expected '=', ',', ';', 'asm' or '__attribute__' before '_Bool'
/opt/rtems-4.11/lm32-rtems4.11/milkymist/lib/include/rtems/score/object.inl:146:22: error: expected '=', ',', ';', 'asm' or '__attribute__' before '_Bool'
/opt/rtems-4.11/lm32-rtems4.11/milkymist/lib/include/rtems/score/object.inl:164:22: error: expected '=', ',', ';', 'asm' or '__attribute__' before '_Bool'
/opt/rtems-4.11/lm32-rtems4.11/milkymist/lib/include/rtems/score/object.inl:185:22: error: expected '=', ',', ';', 'asm' or '__attribute__' before '_Bool'
/opt/rtems-4.11/lm32-rtems4.11/milkymist/lib/include/rtems/score/object.inl:203:22: error: expected '=', ',', ';', 'asm' or '__attribute__' before 'Objects_Control'
/opt/rtems-4.11/lm32-rtems4.11/milkymist/lib/include/rtems/score/object.inl:234:22: error: expected '=', ',', ';', 'asm' or '__attribute__' before 'void'
/opt/rtems-4.11/lm32-rtems4.11/milkymist/lib/include/rtems/score/object.inl:267:22: error: expected '=', ',', ';', 'asm' or '__attribute__' before 'void'
/opt/rtems-4.11/lm32-rtems4.11/milkymist/lib/include/rtems/score/object.inl:287:22: error: expected '=', ',', ';', 'asm' or '__attribute__' before 'void'
/opt/rtems-4.11/lm32-rtems4.11/milkymist/lib/include/rtems/score/object.inl:310:22: error: expected '=', ',', ';', 'asm' or '__attribute__' before 'void'
/opt/rtems-4.11/lm32-rtems4.11/milkymist/lib/include/rtems/score/object.inl:334:22: error: expected '=', ',', ';', 'asm' or '__attribute__' before 'void'
In file included from /opt/rtems-4.11/lm32-rtems4.11/milkymist/lib/include/rtems/score/thread.h:64:0,
                 from /opt/rtems-4.11/lm32-rtems4.11/milkymist/lib/include/rtems/score/coremutex.h:37,
                 from /opt/rtems-4.11/lm32-rtems4.11/milkymist/lib/include/rtems/score/apimutex.h:37,
                 from /opt/rtems-4.11/lm32-rtems4.11/milkymist/lib/include/rtems/confdefs.h:46,
                 from luam.c:407:
/opt/rtems-4.11/lm32-rtems4.11/milkymist/lib/include/rtems/score/priority.h:95:14: error: expected '=', ',', ';', 'asm' or '__attribute__' before 'volatile'
/opt/rtems-4.11/lm32-rtems4.11/milkymist/lib/include/rtems/score/priority.h:103:14: error: expected '=', ',', ';', 'asm' or '__attribute__' before 'Priority_Bit_map_control'
In file included from /opt/rtems-4.11/lm32-rtems4.11/milkymist/lib/include/rtems/score/priority.h:141:0,
                 from /opt/rtems-4.11/lm32-rtems4.11/milkymist/lib/include/rtems/score/thread.h:64,
                 from /opt/rtems-4.11/lm32-rtems4.11/milkymist/lib/include/rtems/score/coremutex.h:37,
                 from /opt/rtems-4.11/lm32-rtems4.11/milkymist/lib/include/rtems/score/apimutex.h:37,
                 from /opt/rtems-4.11/lm32-rtems4.11/milkymist/lib/include/rtems/confdefs.h:46,
                 from luam.c:407:
/opt/rtems-4.11/lm32-rtems4.11/milkymist/lib/include/rtems/score/priority.inl:37:22: error: expected '=', ',', ';', 'asm' or '__attribute__' before 'void'
/opt/rtems-4.11/lm32-rtems4.11/milkymist/lib/include/rtems/score/priority.inl:51:22: error: expected '=', ',', ';', 'asm' or '__attribute__' before '_Bool'
/opt/rtems-4.11/lm32-rtems4.11/milkymist/lib/include/rtems/score/priority.inl:67:22: error: expected '=', ',', ';', 'asm' or '__attribute__' before 'Priority_Bit_map_control'
/opt/rtems-4.11/lm32-rtems4.11/milkymist/lib/include/rtems/score/priority.inl:78:22: error: expected '=', ',', ';', 'asm' or '__attribute__' before 'Priority_Bit_map_control'
/opt/rtems-4.11/lm32-rtems4.11/milkymist/lib/include/rtems/score/priority.inl:92:22: error: expected '=', ',', ';', 'asm' or '__attribute__' before 'Priority_Bit_map_control'
/opt/rtems-4.11/lm32-rtems4.11/milkymist/lib/include/rtems/score/priority.inl:103:22: error: expected '=', ',', ';', 'asm' or '__attribute__' before 'Priority_Bit_map_control'
/opt/rtems-4.11/lm32-rtems4.11/milkymist/lib/include/rtems/score/priority.inl:117:22: error: expected '=', ',', ';', 'asm' or '__attribute__' before 'uint32_t'
/opt/rtems-4.11/lm32-rtems4.11/milkymist/lib/include/rtems/score/priority.inl:131:22: error: expected '=', ',', ';', 'asm' or '__attribute__' before 'void'
/opt/rtems-4.11/lm32-rtems4.11/milkymist/lib/include/rtems/score/priority.inl:145:22: error: expected '=', ',', ';', 'asm' or '__attribute__' before 'void'
/opt/rtems-4.11/lm32-rtems4.11/milkymist/lib/include/rtems/score/priority.inl:159:22: error: expected '=', ',', ';', 'asm' or '__attribute__' before 'Priority_Control'
/opt/rtems-4.11/lm32-rtems4.11/milkymist/lib/include/rtems/score/priority.inl:177:22: error: expected '=', ',', ';', 'asm' or '__attribute__' before 'void'
/opt/rtems-4.11/lm32-rtems4.11/milkymist/lib/include/rtems/score/priority.inl:208:22: error: expected '=', ',', ';', 'asm' or '__attribute__' before '_Bool'
In file included from /opt/rtems-4.11/lm32-rtems4.11/milkymist/lib/include/rtems/score/stack.h:59:0,
                 from /opt/rtems-4.11/lm32-rtems4.11/milkymist/lib/include/rtems/score/thread.h:65,
                 from /opt/rtems-4.11/lm32-rtems4.11/milkymist/lib/include/rtems/score/coremutex.h:37,
                 from /opt/rtems-4.11/lm32-rtems4.11/milkymist/lib/include/rtems/score/apimutex.h:37,
                 from /opt/rtems-4.11/lm32-rtems4.11/milkymist/lib/include/rtems/confdefs.h:46,
                 from luam.c:407:
/opt/rtems-4.11/lm32-rtems4.11/milkymist/lib/include/rtems/score/stack.inl:36:22: error: expected '=', ',', ';', 'asm' or '__attribute__' before 'void'
/opt/rtems-4.11/lm32-rtems4.11/milkymist/lib/include/rtems/score/stack.inl:52:22: error: expected '=', ',', ';', 'asm' or '__attribute__' before 'uint32_t'
/opt/rtems-4.11/lm32-rtems4.11/milkymist/lib/include/rtems/score/stack.inl:65:22: error: expected '=', ',', ';', 'asm' or '__attribute__' before '_Bool'
/opt/rtems-4.11/lm32-rtems4.11/milkymist/lib/include/rtems/score/stack.inl:81:22: error: expected '=', ',', ';', 'asm' or '__attribute__' before 'size_t'
/opt/rtems-4.11/lm32-rtems4.11/milkymist/lib/include/rtems/score/stack.inl:100:22: error: expected '=', ',', ';', 'asm' or '__attribute__' before 'uint32_t'
In file included from /opt/rtems-4.11/lm32-rtems4.11/milkymist/lib/include/rtems/score/states.h:117:0,
                 from /opt/rtems-4.11/lm32-rtems4.11/milkymist/lib/include/rtems/score/thread.h:66,
                 from /opt/rtems-4.11/lm32-rtems4.11/milkymist/lib/include/rtems/score/coremutex.h:37,
                 from /opt/rtems-4.11/lm32-rtems4.11/milkymist/lib/include/rtems/score/apimutex.h:37,
                 from /opt/rtems-4.11/lm32-rtems4.11/milkymist/lib/include/rtems/confdefs.h:46,
                 from luam.c:407:
/opt/rtems-4.11/lm32-rtems4.11/milkymist/lib/include/rtems/score/states.inl:40:22: error: expected '=', ',', ';', 'asm' or '__attribute__' before 'States_Control'
/opt/rtems-4.11/lm32-rtems4.11/milkymist/lib/include/rtems/score/states.inl:57:22: error: expected '=', ',', ';', 'asm' or '__attribute__' before 'States_Control'
/opt/rtems-4.11/lm32-rtems4.11/milkymist/lib/include/rtems/score/states.inl:73:22: error: expected '=', ',', ';', 'asm' or '__attribute__' before '_Bool'
/opt/rtems-4.11/lm32-rtems4.11/milkymist/lib/include/rtems/score/states.inl:88:22: error: expected '=', ',', ';', 'asm' or '__attribute__' before '_Bool'
/opt/rtems-4.11/lm32-rtems4.11/milkymist/lib/include/rtems/score/states.inl:103:22: error: expected '=', ',', ';', 'asm' or '__attribute__' before '_Bool'
/opt/rtems-4.11/lm32-rtems4.11/milkymist/lib/include/rtems/score/states.inl:118:22: error: expected '=', ',', ';', 'asm' or '__attribute__' before '_Bool'
/opt/rtems-4.11/lm32-rtems4.11/milkymist/lib/include/rtems/score/states.inl:133:22: error: expected '=', ',', ';', 'asm' or '__attribute__' before '_Bool'
/opt/rtems-4.11/lm32-rtems4.11/milkymist/lib/include/rtems/score/states.inl:148:22: error: expected '=', ',', ';', 'asm' or '__attribute__' before '_Bool'
/opt/rtems-4.11/lm32-rtems4.11/milkymist/lib/include/rtems/score/states.inl:163:22: error: expected '=', ',', ';', 'asm' or '__attribute__' before '_Bool'
/opt/rtems-4.11/lm32-rtems4.11/milkymist/lib/include/rtems/score/states.inl:178:22: error: expected '=', ',', ';', 'asm' or '__attribute__' before '_Bool'
/opt/rtems-4.11/lm32-rtems4.11/milkymist/lib/include/rtems/score/states.inl:193:22: error: expected '=', ',', ';', 'asm' or '__attribute__' before '_Bool'
/opt/rtems-4.11/lm32-rtems4.11/milkymist/lib/include/rtems/score/states.inl:208:22: error: expected '=', ',', ';', 'asm' or '__attribute__' before '_Bool'
/opt/rtems-4.11/lm32-rtems4.11/milkymist/lib/include/rtems/score/states.inl:223:22: error: expected '=', ',', ';', 'asm' or '__attribute__' before '_Bool'
/opt/rtems-4.11/lm32-rtems4.11/milkymist/lib/include/rtems/score/states.inl:238:22: error: expected '=', ',', ';', 'asm' or '__attribute__' before '_Bool'
/opt/rtems-4.11/lm32-rtems4.11/milkymist/lib/include/rtems/score/states.inl:253:22: error: expected '=', ',', ';', 'asm' or '__attribute__' before '_Bool'
/opt/rtems-4.11/lm32-rtems4.11/milkymist/lib/include/rtems/score/states.inl:268:22: error: expected '=', ',', ';', 'asm' or '__attribute__' before '_Bool'
/opt/rtems-4.11/lm32-rtems4.11/milkymist/lib/include/rtems/score/states.inl:283:22: error: expected '=', ',', ';', 'asm' or '__attribute__' before '_Bool'
/opt/rtems-4.11/lm32-rtems4.11/milkymist/lib/include/rtems/score/states.inl:298:22: error: expected '=', ',', ';', 'asm' or '__attribute__' before '_Bool'
/opt/rtems-4.11/lm32-rtems4.11/milkymist/lib/include/rtems/score/states.inl:315:22: error: expected '=', ',', ';', 'asm' or '__attribute__' before '_Bool'
/opt/rtems-4.11/lm32-rtems4.11/milkymist/lib/include/rtems/score/states.inl:332:22: error: expected '=', ',', ';', 'asm' or '__attribute__' before '_Bool'
/opt/rtems-4.11/lm32-rtems4.11/milkymist/lib/include/rtems/score/states.inl:348:22: error: expected '=', ',', ';', 'asm' or '__attribute__' before '_Bool'
/opt/rtems-4.11/lm32-rtems4.11/milkymist/lib/include/rtems/score/states.inl:364:22: error: expected '=', ',', ';', 'asm' or '__attribute__' before '_Bool'
In file included from /opt/rtems-4.11/lm32-rtems4.11/milkymist/lib/include/rtems/score/thread.h:67:0,
                 from /opt/rtems-4.11/lm32-rtems4.11/milkymist/lib/include/rtems/score/coremutex.h:37,
                 from /opt/rtems-4.11/lm32-rtems4.11/milkymist/lib/include/rtems/score/apimutex.h:37,
                 from /opt/rtems-4.11/lm32-rtems4.11/milkymist/lib/include/rtems/confdefs.h:46,
                 from luam.c:407:
/opt/rtems-4.11/lm32-rtems4.11/milkymist/lib/include/rtems/score/tod.h:124:14: error: expected '=', ',', ';', 'asm' or '__attribute__' before '_Bool'
/opt/rtems-4.11/lm32-rtems4.11/milkymist/lib/include/rtems/score/tod.h:129:14: error: expected '=', ',', ';', 'asm' or '__attribute__' before 'Timestamp_Control'
/opt/rtems-4.11/lm32-rtems4.11/milkymist/lib/include/rtems/score/tod.h:134:14: error: expected '=', ',', ';', 'asm' or '__attribute__' before 'Timestamp_Control'
In file included from /opt/rtems-4.11/lm32-rtems4.11/milkymist/lib/include/rtems/score/tod.h:244:0,
                 from /opt/rtems-4.11/lm32-rtems4.11/milkymist/lib/include/rtems/score/thread.h:67,
                 from /opt/rtems-4.11/lm32-rtems4.11/milkymist/lib/include/rtems/score/coremutex.h:37,
                 from /opt/rtems-4.11/lm32-rtems4.11/milkymist/lib/include/rtems/score/apimutex.h:37,
                 from /opt/rtems-4.11/lm32-rtems4.11/milkymist/lib/include/rtems/confdefs.h:46,
                 from luam.c:407:
/opt/rtems-4.11/lm32-rtems4.11/milkymist/lib/include/rtems/score/tod.inl:39:22: error: expected '=', ',', ';', 'asm' or '__attribute__' before 'void'
/opt/rtems-4.11/lm32-rtems4.11/milkymist/lib/include/rtems/score/tod.inl:48:22: error: expected '=', ',', ';', 'asm' or '__attribute__' before 'void'
/opt/rtems-4.11/lm32-rtems4.11/milkymist/lib/include/rtems/score/tod.inl:57:22: error: expected '=', ',', ';', 'asm' or '__attribute__' before 'void'
In file included from /opt/rtems-4.11/lm32-rtems4.11/milkymist/lib/include/rtems/score/tqdata.h:106:0,
                 from /opt/rtems-4.11/lm32-rtems4.11/milkymist/lib/include/rtems/score/thread.h:68,
                 from /opt/rtems-4.11/lm32-rtems4.11/milkymist/lib/include/rtems/score/coremutex.h:37,
                 from /opt/rtems-4.11/lm32-rtems4.11/milkymist/lib/include/rtems/score/apimutex.h:37,
                 from /opt/rtems-4.11/lm32-rtems4.11/milkymist/lib/include/rtems/confdefs.h:46,
                 from luam.c:407:
/opt/rtems-4.11/lm32-rtems4.11/milkymist/lib/include/rtems/score/tqdata.inl:36:22: error: expected '=', ',', ';', 'asm' or '__attribute__' before 'uint32_t'
/opt/rtems-4.11/lm32-rtems4.11/milkymist/lib/include/rtems/score/tqdata.inl:49:22: error: expected '=', ',', ';', 'asm' or '__attribute__' before '_Bool'
/opt/rtems-4.11/lm32-rtems4.11/milkymist/lib/include/rtems/score/tqdata.inl:61:22: error: expected '=', ',', ';', 'asm' or '__attribute__' before 'void'
In file included from /opt/rtems-4.11/lm32-rtems4.11/milkymist/lib/include/rtems/score/thread.h:69:0,
                 from /opt/rtems-4.11/lm32-rtems4.11/milkymist/lib/include/rtems/score/coremutex.h:37,
                 from /opt/rtems-4.11/lm32-rtems4.11/milkymist/lib/include/rtems/score/apimutex.h:37,
                 from /opt/rtems-4.11/lm32-rtems4.11/milkymist/lib/include/rtems/confdefs.h:46,
                 from luam.c:407:
/opt/rtems-4.11/lm32-rtems4.11/milkymist/lib/include/rtems/score/watchdog.h:152:14: error: expected '=', ',', ';', 'asm' or '__attribute__' before 'volatile'
/opt/rtems-4.11/lm32-rtems4.11/milkymist/lib/include/rtems/score/watchdog.h:159:14: error: expected '=', ',', ';', 'asm' or '__attribute__' before 'volatile'
/opt/rtems-4.11/lm32-rtems4.11/milkymist/lib/include/rtems/score/watchdog.h:166:14: error: expected '=', ',', ';', 'asm' or '__attribute__' before 'volatile'
/opt/rtems-4.11/lm32-rtems4.11/milkymist/lib/include/rtems/score/watchdog.h:173:14: error: expected '=', ',', ';', 'asm' or '__attribute__' before 'Watchdog_Nanoseconds_since_last_tick_routine'
/opt/rtems-4.11/lm32-rtems4.11/milkymist/lib/include/rtems/score/watchdog.h:180:14: error: expected '=', ',', ';', 'asm' or '__attribute__' before 'Chain_Control'
/opt/rtems-4.11/lm32-rtems4.11/milkymist/lib/include/rtems/score/watchdog.h:186:14: error: expected '=', ',', ';', 'asm' or '__attribute__' before 'Chain_Control'
In file included from /opt/rtems-4.11/lm32-rtems4.11/milkymist/lib/include/rtems/score/watchdog.h:306:0,
                 from /opt/rtems-4.11/lm32-rtems4.11/milkymist/lib/include/rtems/score/thread.h:69,
                 from /opt/rtems-4.11/lm32-rtems4.11/milkymist/lib/include/rtems/score/coremutex.h:37,
                 from /opt/rtems-4.11/lm32-rtems4.11/milkymist/lib/include/rtems/score/apimutex.h:37,
                 from /opt/rtems-4.11/lm32-rtems4.11/milkymist/lib/include/rtems/confdefs.h:46,
                 from luam.c:407:
/opt/rtems-4.11/lm32-rtems4.11/milkymist/lib/include/rtems/score/watchdog.inl:37:22: error: expected '=', ',', ';', 'asm' or '__attribute__' before 'void'
/opt/rtems-4.11/lm32-rtems4.11/milkymist/lib/include/rtems/score/watchdog.inl:55:22: error: expected '=', ',', ';', 'asm' or '__attribute__' before '_Bool'
/opt/rtems-4.11/lm32-rtems4.11/milkymist/lib/include/rtems/score/watchdog.inl:69:22: error: expected '=', ',', ';', 'asm' or '__attribute__' before 'void'
/opt/rtems-4.11/lm32-rtems4.11/milkymist/lib/include/rtems/score/watchdog.inl:83:22: error: expected '=', ',', ';', 'asm' or '__attribute__' before 'void'
/opt/rtems-4.11/lm32-rtems4.11/milkymist/lib/include/rtems/score/watchdog.inl:97:22: error: expected '=', ',', ';', 'asm' or '__attribute__' before 'void'
/opt/rtems-4.11/lm32-rtems4.11/milkymist/lib/include/rtems/score/watchdog.inl:109:22: error: expected '=', ',', ';', 'asm' or '__attribute__' before 'void'
/opt/rtems-4.11/lm32-rtems4.11/milkymist/lib/include/rtems/score/watchdog.inl:123:22: error: expected '=', ',', ';', 'asm' or '__attribute__' before 'void'
/opt/rtems-4.11/lm32-rtems4.11/milkymist/lib/include/rtems/score/watchdog.inl:142:22: error: expected '=', ',', ';', 'asm' or '__attribute__' before 'void'
/opt/rtems-4.11/lm32-rtems4.11/milkymist/lib/include/rtems/score/watchdog.inl:160:22: error: expected '=', ',', ';', 'asm' or '__attribute__' before 'void'
/opt/rtems-4.11/lm32-rtems4.11/milkymist/lib/include/rtems/score/watchdog.inl:175:22: error: expected '=', ',', ';', 'asm' or '__attribute__' before 'void'
/opt/rtems-4.11/lm32-rtems4.11/milkymist/lib/include/rtems/score/watchdog.inl:192:22: error: expected '=', ',', ';', 'asm' or '__attribute__' before 'void'
/opt/rtems-4.11/lm32-rtems4.11/milkymist/lib/include/rtems/score/watchdog.inl:208:22: error: expected '=', ',', ';', 'asm' or '__attribute__' before 'Watchdog_Control'
/opt/rtems-4.11/lm32-rtems4.11/milkymist/lib/include/rtems/score/watchdog.inl:222:22: error: expected '=', ',', ';', 'asm' or '__attribute__' before 'Watchdog_Control'
/opt/rtems-4.11/lm32-rtems4.11/milkymist/lib/include/rtems/score/watchdog.inl:236:22: error: expected '=', ',', ';', 'asm' or '__attribute__' before 'Watchdog_Control'
/opt/rtems-4.11/lm32-rtems4.11/milkymist/lib/include/rtems/score/watchdog.inl:250:22: error: expected '=', ',', ';', 'asm' or '__attribute__' before 'Watchdog_Control'
In file included from /opt/rtems-4.11/lm32-rtems4.11/milkymist/lib/include/rtems/score/coremutex.h:37:0,
                 from /opt/rtems-4.11/lm32-rtems4.11/milkymist/lib/include/rtems/score/apimutex.h:37,
                 from /opt/rtems-4.11/lm32-rtems4.11/milkymist/lib/include/rtems/confdefs.h:46,
                 from luam.c:407:
/opt/rtems-4.11/lm32-rtems4.11/milkymist/lib/include/rtems/score/thread.h:423:14: error: expected '=', ',', ';', 'asm' or '__attribute__' before 'void'
/opt/rtems-4.11/lm32-rtems4.11/milkymist/lib/include/rtems/score/thread.h:429:14: error: expected '=', ',', ';', 'asm' or '__attribute__' before 'Objects_Information'
/opt/rtems-4.11/lm32-rtems4.11/milkymist/lib/include/rtems/score/thread.h:435:14: error: expected '=', ',', ';', 'asm' or '__attribute__' before 'Thread_Control'
/opt/rtems-4.11/lm32-rtems4.11/milkymist/lib/include/rtems/score/thread.h:444:14: error: expected '=', ',', ';', 'asm' or '__attribute__' before 'Context_Control'
/opt/rtems-4.11/lm32-rtems4.11/milkymist/lib/include/rtems/score/thread.h:451:14: error: expected '=', ',', ';', 'asm' or '__attribute__' before 'volatile'
/opt/rtems-4.11/lm32-rtems4.11/milkymist/lib/include/rtems/score/thread.h:457:14: error: expected '=', ',', ';', 'asm' or '__attribute__' before 'uint32_t'
/opt/rtems-4.11/lm32-rtems4.11/milkymist/lib/include/rtems/score/thread.h:464:14: error: expected '=', ',', ';', 'asm' or '__attribute__' before 'uint32_t'
/opt/rtems-4.11/lm32-rtems4.11/milkymist/lib/include/rtems/score/thread.h:469:14: error: expected '=', ',', ';', 'asm' or '__attribute__' before 'uint32_t'
/opt/rtems-4.11/lm32-rtems4.11/milkymist/lib/include/rtems/score/thread.h:475:14: error: expected '=', ',', ';', 'asm' or '__attribute__' before 'Chain_Control'
/opt/rtems-4.11/lm32-rtems4.11/milkymist/lib/include/rtems/score/thread.h:481:14: error: expected '=', ',', ';', 'asm' or '__attribute__' before 'Thread_Control'
/opt/rtems-4.11/lm32-rtems4.11/milkymist/lib/include/rtems/score/thread.h:489:14: error: expected '=', ',', ';', 'asm' or '__attribute__' before 'Thread_Control'
/opt/rtems-4.11/lm32-rtems4.11/milkymist/lib/include/rtems/score/thread.h:496:14: error: expected '=', ',', ';', 'asm' or '__attribute__' before 'Thread_Control'
/opt/rtems-4.11/lm32-rtems4.11/milkymist/lib/include/rtems/score/thread.h:505:14: error: expected '=', ',', ';', 'asm' or '__attribute__' before 'struct'
/opt/rtems-4.11/lm32-rtems4.11/milkymist/lib/include/rtems/score/thread.h:515:16: error: expected '=', ',', ';', 'asm' or '__attribute__' before 'Timestamp_Control'
In file included from /opt/rtems-4.11/lm32-rtems4.11/milkymist/lib/include/rtems/score/thread.inl:26:0,
                 from /opt/rtems-4.11/lm32-rtems4.11/milkymist/lib/include/rtems/score/thread.h:847,
                 from /opt/rtems-4.11/lm32-rtems4.11/milkymist/lib/include/rtems/score/coremutex.h:37,
                 from /opt/rtems-4.11/lm32-rtems4.11/milkymist/lib/include/rtems/score/apimutex.h:37,
                 from /opt/rtems-4.11/lm32-rtems4.11/milkymist/lib/include/rtems/confdefs.h:46,
                 from luam.c:407:
/opt/rtems-4.11/lm32-rtems4.11/milkymist/lib/include/rtems/score/sysstate.h:81:14: error: expected '=', ',', ';', 'asm' or '__attribute__' before 'System_state_Codes'
In file included from /opt/rtems-4.11/lm32-rtems4.11/milkymist/lib/include/rtems/score/sysstate.h:87:0,
                 from /opt/rtems-4.11/lm32-rtems4.11/milkymist/lib/include/rtems/score/thread.inl:26,
                 from /opt/rtems-4.11/lm32-rtems4.11/milkymist/lib/include/rtems/score/thread.h:847,
                 from /opt/rtems-4.11/lm32-rtems4.11/milkymist/lib/include/rtems/score/coremutex.h:37,
                 from /opt/rtems-4.11/lm32-rtems4.11/milkymist/lib/include/rtems/score/apimutex.h:37,
                 from /opt/rtems-4.11/lm32-rtems4.11/milkymist/lib/include/rtems/confdefs.h:46,
                 from luam.c:407:
/opt/rtems-4.11/lm32-rtems4.11/milkymist/lib/include/rtems/score/sysstate.inl:33:22: error: expected '=', ',', ';', 'asm' or '__attribute__' before 'void'
/opt/rtems-4.11/lm32-rtems4.11/milkymist/lib/include/rtems/score/sysstate.inl:40:22: error: expected '=', ',', ';', 'asm' or '__attribute__' before 'void'
/opt/rtems-4.11/lm32-rtems4.11/milkymist/lib/include/rtems/score/sysstate.inl:54:22: error: expected '=', ',', ';', 'asm' or '__attribute__' before 'System_state_Codes'
/opt/rtems-4.11/lm32-rtems4.11/milkymist/lib/include/rtems/score/sysstate.inl:59:22: error: expected '=', ',', ';', 'asm' or '__attribute__' before '_Bool'
/opt/rtems-4.11/lm32-rtems4.11/milkymist/lib/include/rtems/score/sysstate.inl:66:22: error: expected '=', ',', ';', 'asm' or '__attribute__' before '_Bool'
/opt/rtems-4.11/lm32-rtems4.11/milkymist/lib/include/rtems/score/sysstate.inl:73:22: error: expected '=', ',', ';', 'asm' or '__attribute__' before '_Bool'
/opt/rtems-4.11/lm32-rtems4.11/milkymist/lib/include/rtems/score/sysstate.inl:80:22: error: expected '=', ',', ';', 'asm' or '__attribute__' before '_Bool'
/opt/rtems-4.11/lm32-rtems4.11/milkymist/lib/include/rtems/score/sysstate.inl:87:22: error: expected '=', ',', ';', 'asm' or '__attribute__' before '_Bool'
/opt/rtems-4.11/lm32-rtems4.11/milkymist/lib/include/rtems/score/sysstate.inl:94:22: error: expected '=', ',', ';', 'asm' or '__attribute__' before '_Bool'
In file included from /opt/rtems-4.11/lm32-rtems4.11/milkymist/lib/include/rtems/score/thread.h:847:0,
                 from /opt/rtems-4.11/lm32-rtems4.11/milkymist/lib/include/rtems/score/coremutex.h:37,
                 from /opt/rtems-4.11/lm32-rtems4.11/milkymist/lib/include/rtems/score/apimutex.h:37,
                 from /opt/rtems-4.11/lm32-rtems4.11/milkymist/lib/include/rtems/confdefs.h:46,
                 from luam.c:407:
/opt/rtems-4.11/lm32-rtems4.11/milkymist/lib/include/rtems/score/thread.inl:40:22: error: expected '=', ',', ';', 'asm' or '__attribute__' before 'void'
/opt/rtems-4.11/lm32-rtems4.11/milkymist/lib/include/rtems/score/thread.inl:65:22: error: expected '=', ',', ';', 'asm' or '__attribute__' before '_Bool'
/opt/rtems-4.11/lm32-rtems4.11/milkymist/lib/include/rtems/score/thread.inl:77:22: error: expected '=', ',', ';', 'asm' or '__attribute__' before '_Bool'
/opt/rtems-4.11/lm32-rtems4.11/milkymist/lib/include/rtems/score/thread.inl:89:22: error: expected '=', ',', ';', 'asm' or '__attribute__' before '_Bool'
/opt/rtems-4.11/lm32-rtems4.11/milkymist/lib/include/rtems/score/thread.inl:100:22: error: expected '=', ',', ';', 'asm' or '__attribute__' before 'void'
/opt/rtems-4.11/lm32-rtems4.11/milkymist/lib/include/rtems/score/thread.inl:112:22: error: expected '=', ',', ';', 'asm' or '__attribute__' before 'void'
/opt/rtems-4.11/lm32-rtems4.11/milkymist/lib/include/rtems/score/thread.inl:127:22: error: expected '=', ',', ';', 'asm' or '__attribute__' before 'void'
/opt/rtems-4.11/lm32-rtems4.11/milkymist/lib/include/rtems/score/thread.inl:140:22: error: expected '=', ',', ';', 'asm' or '__attribute__' before '_Bool'
/opt/rtems-4.11/lm32-rtems4.11/milkymist/lib/include/rtems/score/thread.inl:154:22: error: expected '=', ',', ';', 'asm' or '__attribute__' before 'void'
/opt/rtems-4.11/lm32-rtems4.11/milkymist/lib/include/rtems/score/thread.inl:178:22: error: expected '=', ',', ';', 'asm' or '__attribute__' before 'void'
/opt/rtems-4.11/lm32-rtems4.11/milkymist/lib/include/rtems/score/thread.inl:238:22: error: expected '=', ',', ';', 'asm' or '__attribute__' before 'void'
/opt/rtems-4.11/lm32-rtems4.11/milkymist/lib/include/rtems/score/thread.inl:249:22: error: expected '=', ',', ';', 'asm' or '__attribute__' before '_Bool'
/opt/rtems-4.11/lm32-rtems4.11/milkymist/lib/include/rtems/score/thread.inl:259:22: error: expected '=', ',', ';', 'asm' or '__attribute__' before '_Bool'
/opt/rtems-4.11/lm32-rtems4.11/milkymist/lib/include/rtems/score/thread.inl:268:22: error: expected '=', ',', ';', 'asm' or '__attribute__' before 'void'
/opt/rtems-4.11/lm32-rtems4.11/milkymist/lib/include/rtems/score/thread.inl:277:22: error: expected '=', ',', ';', 'asm' or '__attribute__' before '_Bool'
/opt/rtems-4.11/lm32-rtems4.11/milkymist/lib/include/rtems/score/thread.inl:288:22: error: expected '=', ',', ';', 'asm' or '__attribute__' before '_Bool'
/opt/rtems-4.11/lm32-rtems4.11/milkymist/lib/include/rtems/score/thread.inl:299:22: error: expected '=', ',', ';', 'asm' or '__attribute__' before 'Thread_Control'
/opt/rtems-4.11/lm32-rtems4.11/milkymist/lib/include/rtems/score/thread.inl:308:22: error: expected '=', ',', ';', 'asm' or '__attribute__' before 'void'
/opt/rtems-4.11/lm32-rtems4.11/milkymist/lib/include/rtems/score/thread.inl:319:22: error: expected '=', ',', ';', 'asm' or '__attribute__' before 'struct'
/opt/rtems-4.11/lm32-rtems4.11/milkymist/lib/include/rtems/score/thread.inl:328:22: error: expected '=', ',', ';', 'asm' or '__attribute__' before 'void'
In file included from /opt/rtems-4.11/lm32-rtems4.11/milkymist/lib/include/rtems/score/coremutex.h:454:0,
                 from /opt/rtems-4.11/lm32-rtems4.11/milkymist/lib/include/rtems/score/apimutex.h:37,
                 from /opt/rtems-4.11/lm32-rtems4.11/milkymist/lib/include/rtems/confdefs.h:46,
                 from luam.c:407:
/opt/rtems-4.11/lm32-rtems4.11/milkymist/lib/include/rtems/score/coremutex.inl: In function '_CORE_mutex_Seize_interrupt_trylock_body':
/opt/rtems-4.11/lm32-rtems4.11/milkymist/lib/include/rtems/score/coremutex.inl:136:15: error: '_Thread_Executing' undeclared (first use in this function)
/opt/rtems-4.11/lm32-rtems4.11/milkymist/lib/include/rtems/score/coremutex.inl:136:15: note: each undeclared identifier is reported only once for each function it appears in
/opt/rtems-4.11/lm32-rtems4.11/milkymist/lib/include/rtems/score/coremutex.inl:175:9: warning: implicit declaration of function '_Thread_Disable_dispatch'
/opt/rtems-4.11/lm32-rtems4.11/milkymist/lib/include/rtems/score/coremutex.inl:202:3: warning: implicit declaration of function '_Thread_Is_executing'
In file included from luam.c:407:0:
/opt/rtems-4.11/lm32-rtems4.11/milkymist/lib/include/rtems/confdefs.h: At top level:
/opt/rtems-4.11/lm32-rtems4.11/milkymist/lib/include/rtems/confdefs.h:52:41: error: expected '=', ',', ';', 'asm' or '__attribute__' before 'Initialization_tasks'
/opt/rtems-4.11/lm32-rtems4.11/milkymist/lib/include/rtems/confdefs.h:53:41: error: expected '=', ',', ';', 'asm' or '__attribute__' before 'Device_drivers'
/opt/rtems-4.11/lm32-rtems4.11/milkymist/lib/include/rtems/confdefs.h:54:41: error: expected '=', ',', ';', 'asm' or '__attribute__' before 'Configuration'
/opt/rtems-4.11/lm32-rtems4.11/milkymist/lib/include/rtems/confdefs.h:59:43: error: expected '=', ',', ';', 'asm' or '__attribute__' before 'Configuration_POSIX_API'
In file included from /opt/rtems-4.11/lm32-rtems4.11/milkymist/lib/include/rtems/chain.h:58:0,
                 from /opt/rtems-4.11/lm32-rtems4.11/milkymist/lib/include/rtems/libio.h:33,
                 from /opt/rtems-4.11/lm32-rtems4.11/milkymist/lib/include/rtems/confdefs.h:75,
                 from luam.c:407:
/opt/rtems-4.11/lm32-rtems4.11/milkymist/lib/include/rtems/chain.inl: In function 'rtems_chain_initialize_empty':
/opt/rtems-4.11/lm32-rtems4.11/milkymist/lib/include/rtems/chain.inl:73:3: warning: implicit declaration of function '_Chain_Initialize_empty'
/opt/rtems-4.11/lm32-rtems4.11/milkymist/lib/include/rtems/chain.inl: In function 'rtems_chain_set_off_chain':
/opt/rtems-4.11/lm32-rtems4.11/milkymist/lib/include/rtems/chain.inl:88:3: warning: implicit declaration of function '_Chain_Set_off_chain'
/opt/rtems-4.11/lm32-rtems4.11/milkymist/lib/include/rtems/chain.inl: In function 'rtems_chain_is_node_off_chain':
/opt/rtems-4.11/lm32-rtems4.11/milkymist/lib/include/rtems/chain.inl:105:3: warning: implicit declaration of function '_Chain_Is_node_off_chain'
/opt/rtems-4.11/lm32-rtems4.11/milkymist/lib/include/rtems/chain.inl: In function 'rtems_chain_is_null_node':
/opt/rtems-4.11/lm32-rtems4.11/milkymist/lib/include/rtems/chain.inl:121:3: warning: implicit declaration of function '_Chain_Is_null_node'
/opt/rtems-4.11/lm32-rtems4.11/milkymist/lib/include/rtems/chain.inl: In function 'rtems_chain_head':
/opt/rtems-4.11/lm32-rtems4.11/milkymist/lib/include/rtems/chain.inl:137:3: warning: implicit declaration of function '_Chain_Head'
/opt/rtems-4.11/lm32-rtems4.11/milkymist/lib/include/rtems/chain.inl:137:3: warning: return makes pointer from integer without a cast
/opt/rtems-4.11/lm32-rtems4.11/milkymist/lib/include/rtems/chain.inl: In function 'rtems_chain_tail':
/opt/rtems-4.11/lm32-rtems4.11/milkymist/lib/include/rtems/chain.inl:153:3: warning: implicit declaration of function '_Chain_Tail'
/opt/rtems-4.11/lm32-rtems4.11/milkymist/lib/include/rtems/chain.inl:153:3: warning: return makes pointer from integer without a cast
/opt/rtems-4.11/lm32-rtems4.11/milkymist/lib/include/rtems/chain.inl: In function 'rtems_chain_first':
/opt/rtems-4.11/lm32-rtems4.11/milkymist/lib/include/rtems/chain.inl:170:3: warning: implicit declaration of function '_Chain_First'
/opt/rtems-4.11/lm32-rtems4.11/milkymist/lib/include/rtems/chain.inl:170:3: warning: return makes pointer from integer without a cast
/opt/rtems-4.11/lm32-rtems4.11/milkymist/lib/include/rtems/chain.inl: In function 'rtems_chain_last':
/opt/rtems-4.11/lm32-rtems4.11/milkymist/lib/include/rtems/chain.inl:187:3: warning: implicit declaration of function '_Chain_Last'
/opt/rtems-4.11/lm32-rtems4.11/milkymist/lib/include/rtems/chain.inl:187:3: warning: return makes pointer from integer without a cast
/opt/rtems-4.11/lm32-rtems4.11/milkymist/lib/include/rtems/chain.inl: In function 'rtems_chain_next':
/opt/rtems-4.11/lm32-rtems4.11/milkymist/lib/include/rtems/chain.inl:203:3: warning: implicit declaration of function '_Chain_Next'
/opt/rtems-4.11/lm32-rtems4.11/milkymist/lib/include/rtems/chain.inl:203:3: warning: return makes pointer from integer without a cast
/opt/rtems-4.11/lm32-rtems4.11/milkymist/lib/include/rtems/chain.inl: In function 'rtems_chain_previous':
/opt/rtems-4.11/lm32-rtems4.11/milkymist/lib/include/rtems/chain.inl:219:3: warning: implicit declaration of function '_Chain_Previous'
/opt/rtems-4.11/lm32-rtems4.11/milkymist/lib/include/rtems/chain.inl:219:3: warning: return makes pointer from integer without a cast
/opt/rtems-4.11/lm32-rtems4.11/milkymist/lib/include/rtems/chain.inl: In function 'rtems_chain_are_nodes_equal':
/opt/rtems-4.11/lm32-rtems4.11/milkymist/lib/include/rtems/chain.inl:239:3: warning: implicit declaration of function '_Chain_Are_nodes_equal'
/opt/rtems-4.11/lm32-rtems4.11/milkymist/lib/include/rtems/chain.inl: In function 'rtems_chain_is_empty':
/opt/rtems-4.11/lm32-rtems4.11/milkymist/lib/include/rtems/chain.inl:257:3: warning: implicit declaration of function '_Chain_Is_empty'
/opt/rtems-4.11/lm32-rtems4.11/milkymist/lib/include/rtems/chain.inl: In function 'rtems_chain_is_first':
/opt/rtems-4.11/lm32-rtems4.11/milkymist/lib/include/rtems/chain.inl:276:3: warning: implicit declaration of function '_Chain_Is_first'
/opt/rtems-4.11/lm32-rtems4.11/milkymist/lib/include/rtems/chain.inl: In function 'rtems_chain_is_last':
/opt/rtems-4.11/lm32-rtems4.11/milkymist/lib/include/rtems/chain.inl:294:3: warning: implicit declaration of function '_Chain_Is_last'
/opt/rtems-4.11/lm32-rtems4.11/milkymist/lib/include/rtems/chain.inl: In function 'rtems_chain_has_only_one_node':
/opt/rtems-4.11/lm32-rtems4.11/milkymist/lib/include/rtems/chain.inl:312:3: warning: implicit declaration of function '_Chain_Has_only_one_node'
/opt/rtems-4.11/lm32-rtems4.11/milkymist/lib/include/rtems/chain.inl: In function 'rtems_chain_is_head':
/opt/rtems-4.11/lm32-rtems4.11/milkymist/lib/include/rtems/chain.inl:332:3: warning: implicit declaration of function '_Chain_Is_head'
/opt/rtems-4.11/lm32-rtems4.11/milkymist/lib/include/rtems/chain.inl: In function 'rtems_chain_is_tail':
/opt/rtems-4.11/lm32-rtems4.11/milkymist/lib/include/rtems/chain.inl:349:3: warning: implicit declaration of function '_Chain_Is_tail'
/opt/rtems-4.11/lm32-rtems4.11/milkymist/lib/include/rtems/chain.inl: In function 'rtems_chain_get_unprotected':
/opt/rtems-4.11/lm32-rtems4.11/milkymist/lib/include/rtems/chain.inl:394:3: warning: implicit declaration of function '_Chain_Get_unprotected'
/opt/rtems-4.11/lm32-rtems4.11/milkymist/lib/include/rtems/chain.inl:394:3: warning: return makes pointer from integer without a cast
/opt/rtems-4.11/lm32-rtems4.11/milkymist/lib/include/rtems/chain.inl: In function 'rtems_chain_insert_unprotected':
/opt/rtems-4.11/lm32-rtems4.11/milkymist/lib/include/rtems/chain.inl:422:3: warning: implicit declaration of function '_Chain_Insert_unprotected'
/opt/rtems-4.11/lm32-rtems4.11/milkymist/lib/include/rtems/chain.inl: In function 'rtems_chain_append_unprotected':
/opt/rtems-4.11/lm32-rtems4.11/milkymist/lib/include/rtems/chain.inl:454:3: warning: implicit declaration of function '_Chain_Append_unprotected'
/opt/rtems-4.11/lm32-rtems4.11/milkymist/lib/include/rtems/chain.inl: In function 'rtems_chain_prepend':
/opt/rtems-4.11/lm32-rtems4.11/milkymist/lib/include/rtems/chain.inl:472:3: warning: implicit declaration of function '_Chain_Prepend'
/opt/rtems-4.11/lm32-rtems4.11/milkymist/lib/include/rtems/chain.inl: In function 'rtems_chain_prepend_unprotected':
/opt/rtems-4.11/lm32-rtems4.11/milkymist/lib/include/rtems/chain.inl:490:3: warning: implicit declaration of function '_Chain_Prepend_unprotected'
In file included from luam.c:407:0:
/opt/rtems-4.11/lm32-rtems4.11/milkymist/lib/include/rtems/confdefs.h: At top level:
/opt/rtems-4.11/lm32-rtems4.11/milkymist/lib/include/rtems/confdefs.h:886:7: error: 'DMX_DRIVER_TABLE_ENTRY' undeclared here (not in a function)
In file included from luam.c:407:0:
/opt/rtems-4.11/lm32-rtems4.11/milkymist/lib/include/rtems/confdefs.h:2257:6: error: #error "CONFIGURATION ERROR: No tasks or threads configured!!"
/opt/rtems-4.11/lm32-rtems4.11/milkymist/lib/include/rtems/confdefs.h:2269:2: error: #error "CONFIGURATION ERROR: No initialization tasks or threads configured!!"
/opt/rtems-4.11/lm32-rtems4.11/milkymist/lib/include/rtems/confdefs.h:2335:6: error: #error "CONFIGURATION ERROR: Do you want the clock driver or not?!?"
luam.c:242:12: warning: 'handle_script' defined but not used
make[1]: *** [luam.o] Error 1
make: *** [rtems] Error 2
[3]    24376 exit 2     make rtems RTEMS_MAKEFILE_PATH=/opt/rtems-4.11/lm32-rtems4.11/milkymist