michael@cook-Inspiron-537:~/rockbox$ svn revert -R .
michael@cook-Inspiron-537:~/rockbox$ svn up
U    docs/CREDITS
U    firmware/target/arm/as3525/sd-as3525v2.c
U    manual/getting_started/installation.tex
Updated to revision 28903.
michael@cook-Inspiron-537:~/rockbox$ patch </home/michael/FS-11664-Dec26-2010.diff 
(Stripping trailing CRs from patch.)
patching file sansafuzev2.h
Hunk #1 FAILED at 193.
1 out of 1 hunk FAILED -- saving rejects to file sansafuzev2.h.rej
(Stripping trailing CRs from patch.)
patching file sansaclipplus.h
Hunk #1 FAILED at 179.
1 out of 1 hunk FAILED -- saving rejects to file sansaclipplus.h.rej
(Stripping trailing CRs from patch.)
patching file usb_storage.c
Hunk #1 FAILED at 23.
1 out of 1 hunk FAILED -- saving rejects to file usb_storage.c.rej
(Stripping trailing CRs from patch.)
patching file usb-drv-as3525v2.c
Hunk #1 FAILED at 31.
Hunk #2 FAILED at 90.
Hunk #3 FAILED at 449.
patch unexpectedly ends in middle of line
Hunk #4 FAILED at 587.
4 out of 4 hunks FAILED -- saving rejects to file usb-drv-as3525v2.c.rej
michael@cook-Inspiron-537:~/rockbox$ svn revert -R .
michael@cook-Inspiron-537:~/rockbox$