-- The C compiler identification is GNU
-- The CXX compiler identification is GNU
-- Check for working C compiler: /usr/bin/gcc
-- Check for working C compiler: /usr/bin/gcc -- works
-- Detecting C compiler ABI info
-- Detecting C compiler ABI info - done
-- Check for working CXX compiler: /usr/bin/c++
-- Check for working CXX compiler: /usr/bin/c++ -- works
-- Detecting CXX compiler ABI info
-- Detecting CXX compiler ABI info - done
-- Looking for Q_WS_X11
-- Looking for Q_WS_X11 - found
-- Looking for Q_WS_WIN
-- Looking for Q_WS_WIN - not found.
-- Looking for Q_WS_QWS
-- Looking for Q_WS_QWS - not found.
-- Looking for Q_WS_MAC
-- Looking for Q_WS_MAC - not found.
-- Found Qt-Version 4.7.0 (using /usr/bin/qmake)
-- Looking for XOpenDisplay in /usr/lib/libX11.so;/usr/lib/libXext.so;/usr/lib/libXft.so;/usr/lib/libXau.so;/usr/lib/libXdmcp.so;/usr/lib/libXpm.so
-- Looking for XOpenDisplay in /usr/lib/libX11.so;/usr/lib/libXext.so;/usr/lib/libXft.so;/usr/lib/libXau.so;/usr/lib/libXdmcp.so;/usr/lib/libXpm.so - found
-- Looking for gethostbyname
-- Looking for gethostbyname - found
-- Looking for connect
-- Looking for connect - found
-- Looking for remove
-- Looking for remove - found
-- Looking for shmat
-- Looking for shmat - found
-- Looking for IceConnectionNumber in ICE
-- Looking for IceConnectionNumber in ICE - found
-- Found X11: /usr/lib/libX11.so
-- Looking for include files CMAKE_HAVE_PTHREAD_H
-- Looking for include files CMAKE_HAVE_PTHREAD_H - found
-- Looking for pthread_create in pthreads
-- Looking for pthread_create in pthreads - not found
-- Looking for pthread_create in pthread
-- Looking for pthread_create in pthread - found
-- Found Threads: TRUE 
-- Found OpenSSL: /usr/lib/libssl.so
-- Looking for _POSIX_TIMERS
-- Looking for _POSIX_TIMERS - found
-- Found Automoc4: /usr/bin/automoc4 
-- Found Perl: /usr/bin/perl 
-- Found Phonon: /usr/include  (found version "4.4.2", required is "4.3.80")
-- Performing Test _OFFT_IS_64BIT
-- Performing Test _OFFT_IS_64BIT - Success
-- Performing Test HAVE_FPIE_SUPPORT
-- Performing Test HAVE_FPIE_SUPPORT - Success
-- Performing Test __KDE_HAVE_W_OVERLOADED_VIRTUAL
-- Performing Test __KDE_HAVE_W_OVERLOADED_VIRTUAL - Success
-- Performing Test __KDE_HAVE_GCC_VISIBILITY
-- Performing Test __KDE_HAVE_GCC_VISIBILITY - Success
-- Found KDE 4.5 include dir: /usr/include
-- Found KDE 4.5 library dir: /usr/lib
-- Found the KDE4 kconfig_compiler preprocessor: /usr/bin/kconfig_compiler
-- Found automoc4: /usr/bin/automoc4
-- found NVidia
-- Configuring done
-- Generating done
-- Build files have been written to: /tmp/yaourt-tmp-leonardo/aur-kde-extragear-plasmoids/src/yasp-1.3
Scanning dependencies of target yasp_automoc
Generating widget.moc                                                                                                 
Generating applet.moc                                                                                                 
Generating frame.moc                                                                                                  
Generating label.moc                                                                                                  
Generating moc_layout.cpp                                                                                             
[  0%] Built target yasp_automoc                                                                                      
[  2%] Generating qrc_icons.cxx
[  4%] Generating ui_appearance.h                                                                                     
[  6%] Generating ui_misc.h                                                                                           
Scanning dependencies of target yasp                                                                                  
[  8%] Building CXX object src/CMakeFiles/yasp.dir/yasp_automoc.o                                                     
[ 10%] Building CXX object src/CMakeFiles/yasp.dir/libs/widget.o                                                      
[ 13%] Building CXX object src/CMakeFiles/yasp.dir/libs/applet.o                                                      
[ 15%] Building CXX object src/CMakeFiles/yasp.dir/libs/label.o                                                       
[ 17%] Building CXX object src/CMakeFiles/yasp.dir/libs/layout.o                                                      
[ 19%] Building CXX object src/CMakeFiles/yasp.dir/libs/index.o                                                       
[ 21%] Building CXX object src/CMakeFiles/yasp.dir/libs/frame.o                                                       
[ 23%] Building CXX object src/CMakeFiles/yasp.dir/qrc_icons.o                                                        
Linking CXX shared library ../lib/libyasp.so                                                                          
[ 23%] Built target yasp                                                                                              
Scanning dependencies of target yaspplugin_automoc
Generating plugin.moc                                                                                                 
[ 23%] Built target yaspplugin_automoc                                                                                
Scanning dependencies of target yaspplugin
[ 26%] Building CXX object src/CMakeFiles/yaspplugin.dir/yaspplugin_automoc.o                                         
[ 28%] Building CXX object src/CMakeFiles/yaspplugin.dir/libs/plugin.o                                                
/tmp/yaourt-tmp-leonardo/aur-kde-extragear-plasmoids/src/yasp-1.3/src/libs/plugin.cpp:33:1: warning: unused parameter ‘args’
Linking CXX shared library ../lib/libyaspplugin.so
[ 28%] Built target yaspplugin                                                                                        
[ 30%] Generating yaspd.moc
Scanning dependencies of target yaspd                                                                                 
[ 32%] Building CXX object src/yasp/CMakeFiles/yaspd.dir/main.o                                                       
/tmp/yaourt-tmp-leonardo/aur-kde-extragear-plasmoids/src/yasp-1.3/src/yasp/main.cpp:110:6: warning: unused parameter ‘arg’
[ 34%] Building CXX object src/yasp/CMakeFiles/yaspd.dir/yaspd.o
/tmp/yaourt-tmp-leonardo/aur-kde-extragear-plasmoids/src/yasp-1.3/src/yasp/yaspd.cpp:296:6: warning: unused parameter ‘socket’
[ 36%] Building CXX object src/yasp/CMakeFiles/yaspd.dir/file.o
Linking CXX executable yaspd                                                                                          
[ 36%] Built target yaspd                                                                                             
Scanning dependencies of target yasp_engine_automoc
Generating engine.moc                                                                                                 
Generating controller.moc                                                                                             
[ 36%] Built target yasp_engine_automoc                                                                               
Scanning dependencies of target yasp_engine
[ 39%] Building CXX object src/engine/CMakeFiles/yasp_engine.dir/yasp_engine_automoc.o                                
[ 41%] Building CXX object src/engine/CMakeFiles/yasp_engine.dir/engine.o                                             
/tmp/yaourt-tmp-leonardo/aur-kde-extragear-plasmoids/src/yasp-1.3/src/engine/engine.cpp: In constructor ‘Yasp::Engine::Engine(QObject*, const QVariantList&)’:
/tmp/yaourt-tmp-leonardo/aur-kde-extragear-plasmoids/src/yasp-1.3/src/engine/engine.cpp:52:15: error: call of overloaded ‘QString(int)’ is ambiguous
/usr/include/QtCore/qstring.h:428:43: note: candidates are: QString::QString(const QByteArray&)
/usr/include/QtCore/qstring.h:426:43: note:                 QString::QString(const char*)
/usr/include/QtCore/qstring.h:727:8: note:                 QString::QString(const QString&)
/usr/include/QtCore/qstring.h:106:5: note:                 QString::QString(QChar)
/usr/include/QtCore/qstring.h:105:14: note:                 QString::QString(const QChar*)
make[2]: *** [src/engine/CMakeFiles/yasp_engine.dir/engine.o] Error 1
make[1]: *** [src/engine/CMakeFiles/yasp_engine.dir/all] Error 2
make: *** [all] Error 2